program: Gaussian 09
title: 000284347
version: EM64L-G09RevD.01
frameworkgroup: C1[X(C12H17NO2S)]
method: RPBEPBE
basis: SDD
operation: Freq
keyword: #p
keyword: freq=noraman
keyword: PBEPBE/SDD
title: #p freq=noraman PBEPBE/SDD
converged: YES YES NO NO
title: Mulliken charges:
elementType: S O O N C C C C C C C C C C C C H H H H H H H H H H H H H H H H H
charge: 0.954012 -0.537620 -0.563120 -0.541723 0.252819 -0.679846 -0.707595 -0.689215 -0.443170 -0.162857 0.470176 -0.376502 -0.362213 -0.231308 -0.226187 -0.230884 0.314435 0.239329 0.216294 0.210054 0.251414 0.219847 0.215240 0.204260 0.208177 0.273924 0.274858 0.279183 0.239911 0.226905 0.234336 0.231851 0.235213
chargesum: 0.00000
title: Mulliken charges with hydrogens summed into heavy atoms:
elementType: S O O N C C C C C C C C C C C C
charge: 0.954012 -0.537620 -0.563120 -0.227288 0.252819 -0.014169 -0.021094 -0.002853 -0.168312 0.116326 0.470176 -0.136591 -0.135308 0.003028 0.005663 0.004330
polarizability: 2.79603721e+02 2.46008105e+00 1.51124967e+02 1.05026830e+01 -1.78320270e+01 1.24818927e+02
1716.lowfreq: -12.8983 -6.3200 -0.0014 -0.0012 0.0008 7.0214 17.3108 26.6928 43.5807
frequency: 15.9681 26.6433 43.5440 82.9411 90.5564 112.2259 154.5555 174.9206 189.2932 202.8712 205.1661 221.1543 251.9710 263.1456 264.8237 294.5257 328.0597 346.7893 383.3762 401.5818 404.5366 420.4106 431.7161 468.9316 507.3208 510.8750 571.4047 615.2459 693.4169 696.4120 740.9256 755.2548 793.2686 812.0315 817.4980 831.0267 848.9489 882.2976 911.7918 925.0269 926.7346 928.7609 952.3336 979.4825 989.8821 995.2780 1006.2389 1022.8868 1026.4120 1033.7341 1082.2905 1164.6350 1177.5587 1194.7943 1195.3371 1217.9100 1230.8108 1235.5891 1292.1902 1336.1967 1341.7853 1370.8521 1373.7843 1386.6489 1400.7002 1439.4644 1450.1796 1463.6440 1466.2554 1478.3616 1483.9871 1484.6428 1502.2704 1583.3952 1611.2008 1624.9447 2975.1394 2979.4052 2984.4720 3067.9950 3075.6330 3080.3612 3086.5698 3088.1856 3096.7405 3100.0434 3127.5427 3131.1238 3142.9583 3154.4200 3169.5674 3198.9467 3328.3174
redmass: 3.8586 3.9151 3.5056 5.1496 4.4892 3.1938 4.4689 4.9675 1.6764 3.2385 2.0375 3.9568 3.7714 1.1035 1.0911 4.5010 2.5357 2.9851 5.5126 2.8910 3.2031 3.8063 2.4130 3.4661 3.2378 3.7360 7.1927 6.4535 2.0504 3.6531 4.0149 1.5763 9.5128 1.9684 1.8532 4.4701 1.2575 2.5833 1.6910 1.5254 5.4578 1.5748 1.2036 1.3853 6.2090 1.2849 1.3050 1.4248 2.1840 1.4099 1.5884 1.1680 1.0610 1.1615 1.8992 2.1241 2.7879 2.6745 1.4829 1.2563 1.4044 1.2059 1.2210 7.2691 1.2062 2.2786 1.0475 1.0513 1.0501 1.0534 1.1032 2.0983 1.0534 5.8592 5.9866 6.1199 1.0358 1.0350 1.0358 1.0995 1.0991 1.0887 1.1012 1.0992 1.1000 1.1000 1.0863 1.0874 1.0919 1.0966 1.1017 1.0970 1.0739
irintensity: 0.5505 0.7685 0.5982 1.6176 0.4604 1.5346 1.7948 8.8084 1.9730 0.5942 0.6697 2.4302 6.5357 0.6429 0.7493 2.5782 1.3708 3.8774 32.8146 22.8164 46.7748 6.6102 14.1680 72.6117 4.1360 20.5414 19.6896 0.0490 39.4331 26.5823 16.4467 95.1909 82.0450 51.9112 115.1872 7.1146 0.3384 2.7043 1.9507 6.1764 52.6181 1.5279 0.2139 1.3923 0.6559 23.3648 18.0382 8.1707 5.7983 1.2686 5.1355 7.9998 0.9430 14.6076 50.2111 57.3692 32.9809 10.3122 7.4526 9.9001 0.1331 23.3206 34.1410 5.5098 18.6455 11.4254 1.8453 3.5512 2.8140 16.0446 11.1755 7.4242 25.3899 4.4278 3.3520 28.1763 28.3622 39.9722 18.3115 6.6731 42.3206 1.0911 17.3685 31.2315 9.7331 37.8279 3.9397 0.8229 8.2948 33.0749 25.0398 11.2943 11.0291
temp: 298.150 k
press: 1.00000 atm
elementType: 16 8 8 7 6 6 6 6 6 6 6 6 6 6 6 6 1 1 1 1 1 1 1 1 1 1 1 1 1 1 1 1 1
symmnumber: 1
zpe: 693421.6 jmol-1
zpe.correction: 0.264110 hartree
zpe.thermalcorrener: 0.281978 hartree
zpe.thermalcorrenthalpy: 0.282922 hartree
zpe.thermalcorrgfe: 0.216994 hartree
zpe.sumelectzpe: -1069.327687 hartree
zpe.sumelectthermal: -1069.309819 hartree
zpe.sumelectthermalent: -1069.308875 hartree
zpe.sumelectthermalfe: -1069.374803 hartree
dipole: 1.9516 4.3389 1.8456
dipole: 5.1031
quadrupole: -79.8919 -109.2916 -109.6413
quadrupole: -5.9467 -4.7503 -7.8879
quadrupole: 19.7164 -9.6833 -10.0330 -5.9467 -4.7503 -7.8879
hfenergy: -1069.5917969 hartree
pointgroup: C01 [X(C12H17N1O2S1)]
dipole: 0.6796224 -1.87618 0.221216 debye
polarizability: 279.3229451|-12.2396366|130.8684968|-1.5773722|-21.0304328|145.3561726 unknown
InChI: InChI=1S/C12H17NO2S/c1-12(2,3)13-16(14,15)10-9-11-7-5-4-6-8-11/h4-10,13H,1-3H3
charge 0 multiplicity 1
33 atoms
S  -1.599022 1.372546 -0.288029
O  -2.304666 2.164428 0.957237
O  -1.200178 2.149088 -1.670732
N  -2.597648 -0.113123 -0.868773
C  -3.807501 -0.545622 -0.075127
C  -4.292871 -1.808582 -0.838905
C  -3.36056 -0.931459 1.353885
C  -4.926573 0.530016 -0.039236
C  -0.058675 0.561264 0.385657
C  1.087924 0.697475 -0.320802
C  2.416314 0.176775 0.044328
C  3.502579 0.424027 -0.841524
C  2.661968 -0.559778 1.238485
C  4.797605 -0.050752 -0.546378
C  3.955131 -1.032989 1.532022
C  5.028389 -0.781268 0.641579
H  -2.853743 0.175061 -1.836741
H  -3.496522 -2.570916 -0.877253
H  -5.171651 -2.234041 -0.320867
H  -4.595252 -1.563262 -1.874364
H  -3.030274 -0.041351 1.918188
H  -2.540635 -1.671015 1.313142
H  -4.207987 -1.382653 1.899354
H  -5.248093 0.79765 -1.063878
H  -5.809584 0.146048 0.503878
H  -4.568892 1.441539 0.469023
H  -0.24913 0.065898 1.339579
H  1.016967 1.262197 -1.26443
H  3.32429 0.992299 -1.762345
H  1.843265 -0.759636 1.938651
H  5.622955 0.148341 -1.238225
H  4.132898 -1.597191 2.454068
H  6.032974 -1.150813 0.87443
