program: Gaussian 09
title: 000284343
version: EM64L-G09RevD.01
frameworkgroup: C1[X(C20H16O2S)]
method: RPBEPBE
basis: SDD
operation: Freq
keyword: #p
keyword: freq=noraman
keyword: PBEPBE/SDD
title: #p freq=noraman PBEPBE/SDD
converged: YES YES NO NO
title: Mulliken charges:
elementType: S O O C C C C C C C C C C C C C C C C C C C C H H H H H H H H H H H H H H H H
charge: 0.869891 -0.538594 -0.556292 0.356575 0.492790 0.341040 -0.040502 -0.403991 -0.394013 -0.405054 -0.382823 -0.512628 -0.166615 -0.248611 -0.266862 -0.390525 -0.390616 -0.203385 -0.207115 -0.235240 -0.234925 -0.217954 -0.237953 0.243455 0.241576 0.238982 0.226719 0.279999 0.283258 0.281742 0.292007 0.238756 0.238426 0.240367 0.240849 0.228854 0.228747 0.236776 0.232885
chargesum: 0.00000
title: Mulliken charges with hydrogens summed into heavy atoms:
elementType: S O O C C C C C C C C C C C C C C C C C C C C
charge: 0.869891 -0.538594 -0.556292 0.356575 0.492790 0.341040 -0.040502 -0.160536 -0.152437 -0.166072 -0.156104 -0.232630 0.116644 0.033131 0.025145 -0.151769 -0.152190 0.036982 0.033734 -0.006385 -0.006177 0.018823 -0.005067
polarizability: 4.65090943e+02 -2.62397911e+00 1.64918486e+02 -1.65530799e+01 4.37250735e+00 2.22703366e+02
1716.lowfreq: -1.1430 -0.0016 0.0003 0.0014 3.5542 10.2787 19.7945 20.9737 30.7260
frequency: 19.5858 20.9454 30.6683 44.2834 56.8382 70.8427 109.0976 114.7029 140.9110 144.2448 159.1499 211.1588 221.6620 242.1474 245.8995 308.7947 323.3845 346.3506 382.6411 395.7709 403.8949 404.1493 412.7372 445.4395 458.9465 494.4925 502.7279 555.5962 584.4790 603.1887 613.9569 637.2540 656.2090 681.7182 693.1634 700.7865 726.1804 731.6169 761.2397 767.7499 783.5322 801.1257 834.2836 841.6496 850.5549 853.3229 854.0821 919.8765 922.1579 935.0359 964.2258 974.5795 975.1094 979.0252 983.5101 989.0085 995.9307 996.0191 1003.8593 1005.4733 1008.7907 1016.8386 1040.9399 1049.3848 1075.8440 1086.5028 1115.7893 1160.5978 1172.7075 1174.9678 1175.9686 1192.8948 1205.7729 1240.4490 1290.7742 1293.7311 1300.8731 1307.5035 1325.2063 1364.7595 1376.7482 1384.2961 1422.1210 1435.6368 1438.6130 1453.1228 1477.5122 1516.4472 1557.3700 1578.7498 1586.7942 1604.6804 1609.2468 1616.0865 1624.1226 3068.9325 3125.2624 3127.7259 3129.7608 3131.5595 3135.7787 3142.3743 3144.8536 3149.9399 3152.5347 3153.2507 3156.5930 3162.2220 3167.1698 3173.1071 3189.8647
redmass: 5.1846 4.5226 4.0328 6.1937 6.5982 3.6616 4.9596 5.9813 3.9595 7.8518 6.1034 3.5785 5.4323 6.9130 6.1660 6.4788 6.1785 4.8778 7.0653 4.5527 2.8304 2.8371 3.0457 4.6799 6.3806 4.3423 3.5075 2.5101 7.8586 6.4742 6.5026 6.9436 6.8632 5.5389 2.3625 1.7423 4.8911 2.7978 1.5354 1.7509 7.4971 2.0352 3.3254 1.4287 1.3109 1.2494 1.5533 9.4151 1.5151 1.3668 1.3595 1.5034 1.3842 5.7490 1.3987 4.5223 2.0165 2.3874 1.2827 1.3176 4.0547 2.7705 1.9039 2.1394 1.5363 1.6247 1.3959 1.1838 1.0579 1.0537 1.1236 1.1129 1.1451 2.3427 1.7078 2.4713 1.3076 1.5215 1.3021 2.4354 8.8055 8.3752 3.9257 2.2511 2.3882 2.0497 2.1647 2.8017 6.0884 5.8449 6.2247 6.9555 5.9512 6.1842 6.1688 1.0881 1.0848 1.0875 1.0878 1.0871 1.0855 1.0920 1.0882 1.0964 1.0956 1.0926 1.0970 1.0969 1.1016 1.1017 1.0971
irintensity: 0.6611 0.5898 0.0075 0.3291 1.4612 0.2323 0.9799 2.8561 3.1094 1.6635 1.5359 0.1325 0.4706 4.8839 3.2066 16.0887 7.8399 2.4433 11.7062 10.2361 0.0239 2.7206 1.3174 18.7025 77.4277 84.8329 7.8384 3.4121 60.1446 0.0699 0.0118 0.3744 3.3914 40.6575 47.0460 45.5687 23.9682 11.7220 83.0213 124.4604 82.2766 51.9841 10.4447 7.8196 2.4089 0.5136 18.1396 63.3627 2.9716 0.9456 3.8109 0.3068 1.5195 3.0153 0.2336 0.0971 5.7968 7.1339 22.9618 14.4453 2.3941 0.3621 2.9639 27.6606 4.9806 8.4404 1.2445 11.7678 0.2272 0.0679 10.5539 0.2637 20.0839 24.1892 5.3565 7.6475 4.1517 4.6883 9.3971 19.2326 2.3838 4.6354 10.5462 16.3138 7.0958 15.4092 39.3040 9.9290 5.0698 6.9909 2.8995 1.4197 45.6956 96.4803 4.0296 1.6253 12.0747 1.3949 11.2311 7.8073 0.8785 11.4071 9.4082 7.0825 51.3270 0.7965 0.1838 6.3269 33.4344 35.8096 20.2270
temp: 298.150 k
press: 1.00000 atm
elementType: 16 8 8 6 6 6 6 6 6 6 6 6 6 6 6 6 6 6 6 6 6 6 6 1 1 1 1 1 1 1 1 1 1 1 1 1 1 1 1
symmnumber: 1
zpe: 780442.2 jmol-1
zpe.correction: 0.297255 hartree
zpe.thermalcorrener: 0.317499 hartree
zpe.thermalcorrenthalpy: 0.318443 hartree
zpe.thermalcorrgfe: 0.245324 hartree
zpe.sumelectzpe: -1318.467593 hartree
zpe.sumelectthermal: -1318.447348 hartree
zpe.sumelectthermalent: -1318.446404 hartree
zpe.sumelectthermalfe: -1318.519523 hartree
dipole: -3.5870 6.0821 -0.4716
dipole: 7.0767
quadrupole: -122.7919 -154.4836 -129.6974
quadrupole: 27.5475 -3.0727 0.1804
quadrupole: 12.8657 -18.8259 5.9602 27.5475 -3.0727 0.1804
hfenergy: -1318.7648474 hartree
pointgroup: C01 [X(C20H16O2S1)]
dipole: -1.3441557 2.425264 0.2512886 debye
polarizability: 463.9771633|-7.581375|165.28929|-22.5707217|-4.8499664|223.4463417 unknown
InChI: InChI=1S/C20H16O2S/c21-23(22,20-9-5-2-6-10-20)16-15-17-11-13-19(14-12-17)18-7-3-1-4-8-18/h1-16H
charge 0 multiplicity 1
39 atoms
S  3.662423 -1.484513 -0.401062
O  4.173856 -2.189689 -1.789683
O  3.598988 -2.279471 1.035171
C  -3.24765 -0.073574 0.088313
C  -0.446269 -0.721254 0.123056
C  -4.698575 0.26238 0.06435
C  4.745687 0.054695 -0.142954
C  -2.672407 -0.784891 1.177487
C  -2.386566 0.306352 -0.98316
C  -1.301981 -1.100818 1.194792
C  -1.018662 -0.009022 -0.969524
C  1.932921 -0.824996 -0.728731
C  0.976727 -1.082344 0.196191
C  4.863544 0.575741 1.155133
C  5.429901 0.561104 -1.259054
C  -5.413231 0.328423 -1.164577
C  -5.409754 0.52456 1.268895
C  5.700909 1.701482 1.334069
C  6.262313 1.687942 -1.060105
C  -6.787896 0.644155 -1.188773
C  -6.784279 0.841086 1.245704
C  6.390616 2.256759 0.229354
C  -7.481317 0.902733 0.016513
H  -3.310501 -1.121859 2.001361
H  -2.794379 0.882504 -1.82086
H  -0.884228 -1.6612 2.039758
H  -0.388409 0.307629 -1.807857
H  1.860249 -0.343541 -1.706708
H  1.308294 -1.632992 1.092473
H  4.340169 0.102185 1.992456
H  5.334192 0.070133 -2.233517
H  -4.898695 0.097277 -2.104047
H  -4.876875 0.512435 2.226423
H  5.819969 2.1361 2.332104
H  6.813484 2.111715 -1.906116
H  -7.320178 0.678875 -2.145803
H  -7.309477 1.048584 2.18464
H  7.039742 3.126795 0.376851
H  -8.548758 1.148319 -0.001663
