program: Gaussian 09
title: 000022678
version: EM64L-G09RevD.01
frameworkgroup: C1[X(C10H17ClO2)]
method: RPBEPBE
basis: SDD
operation: Freq
keyword: #p
keyword: freq=noraman
keyword: PBEPBE/SDD
title: #p freq=noraman PBEPBE/SDD
converged: YES YES NO NO
title: Mulliken charges:
elementType: Cl O O C C C C C C C C C C H H H H H H H H H H H H H H H H H
charge: -0.015863 -0.267574 -0.209729 0.023507 -0.449628 -0.443701 -0.403023 -0.403145 -0.383045 -0.445366 -0.296819 0.348624 -0.694719 0.191230 0.190655 0.206466 0.198633 0.191949 0.192494 0.200908 0.199591 0.193562 0.201683 0.189063 0.215236 0.214562 0.244282 0.230541 0.290007 0.289618
chargesum: 0.00000
title: Mulliken charges with hydrogens summed into heavy atoms:
elementType: Cl O O C C C C C C C C C C
charge: -0.015863 -0.267574 -0.209729 0.214738 -0.052507 -0.053119 -0.009621 -0.009992 0.007700 -0.015568 0.178005 0.348624 -0.115094
polarizability: 1.63137481e+02 -5.03263481e+00 1.09176908e+02 8.80870620e-01 -3.28263348e+00 8.97770263e+01
1716.lowfreq: -22.3765 -13.8827 -0.0019 -0.0016 -0.0015 6.4903 9.5189 27.6165 33.3814
frequency: -13.6639 25.9430 32.5230 56.0032 79.6928 127.8233 155.7642 175.1552 188.1764 223.2817 244.0093 316.6580 345.8049 387.2277 435.1758 439.1022 467.1774 540.4208 550.9182 652.3716 735.6037 761.6243 783.1672 789.0924 841.8998 859.9297 875.1891 891.4559 911.1418 915.0249 939.8803 962.5389 992.8939 1050.5576 1057.9803 1065.9603 1091.0515 1095.0836 1115.6620 1119.5839 1149.5890 1150.9246 1178.4037 1195.2393 1245.7813 1258.1170 1259.9165 1277.2709 1280.6126 1283.0530 1312.3142 1320.0354 1336.5459 1339.2335 1341.7641 1344.1378 1362.7127 1373.2760 1423.7403 1458.1273 1461.7057 1464.5090 1466.7264 1469.8529 1476.2647 1481.8681 1671.2277 2934.8527 2953.5472 2959.5245 2965.5870 2966.6198 2966.8431 2982.0947 3004.6866 3017.2830 3021.7931 3028.3832 3029.8321 3037.1065 3042.5320 3059.7317 3080.1899 3134.8340
redmass: 4.3542 4.6873 3.9877 5.7997 2.7715 3.4257 2.8430 3.5220 5.2435 1.7901 6.5593 1.8319 3.9026 3.6756 2.0851 2.7111 2.9251 2.9070 1.9601 6.4974 5.9435 1.7925 1.4372 1.5751 2.1775 2.8838 2.4585 1.6171 1.9036 1.8034 5.4516 2.3047 1.4723 1.8693 1.1973 1.9090 1.9923 2.2952 2.5982 3.0671 1.3997 1.4669 1.3799 1.4196 1.3017 1.2100 1.2649 1.2045 1.2290 1.3848 1.2785 1.2679 1.3793 1.5056 1.4700 1.5326 1.4983 1.5087 1.0871 1.0891 1.0905 1.0892 1.0888 1.0810 1.0941 1.0874 10.7036 1.0808 1.0619 1.0621 1.0631 1.0615 1.0656 1.0599 1.0593 1.0960 1.0994 1.0944 1.1016 1.1019 1.1030 1.0571 1.1080 1.1074
irintensity: 3.7436 2.3699 0.0899 0.8363 0.0274 1.3547 7.3757 1.2946 0.8983 0.0912 4.4961 0.5085 4.3421 6.3512 2.2449 3.2857 0.6812 2.5824 2.7887 6.0461 28.4847 1.6186 0.3296 0.8519 5.6435 5.6182 0.9845 14.9325 2.0374 7.6285 86.1918 22.4572 2.5125 1.7262 1.1877 27.8298 1.3712 75.4927 45.8856 327.3969 1.3823 0.4535 2.2820 0.5470 0.5273 1.2391 1.3492 1.3036 1.7154 32.4929 1.2990 1.4360 0.1234 0.1971 0.7586 1.2054 0.9193 2.8599 29.1879 1.2255 5.5676 9.3188 4.9858 20.9208 1.4959 11.8949 161.0280 8.0632 25.6238 57.0515 26.0051 29.9189 32.3225 24.2335 16.8681 87.2980 34.6868 57.2293 22.0600 4.9117 144.0603 8.5047 43.6315 1.8760
temp: 298.150 k
press: 1.00000 atm
elementType: 17 8 8 6 6 6 6 6 6 6 6 6 6 1 1 1 1 1 1 1 1 1 1 1 1 1 1 1 1 1
symmnumber: 1
zpe: 669112.9 jmol-1
zpe.correction: 0.254852 hartree
zpe.thermalcorrener: 0.268253 hartree
zpe.thermalcorrenthalpy: 0.269197 hartree
zpe.thermalcorrgfe: 0.212463 hartree
zpe.sumelectzpe: -1000.729654 hartree
zpe.sumelectthermal: -1000.716252 hartree
zpe.sumelectthermalent: -1000.715308 hartree
zpe.sumelectthermalfe: -1000.772043 hartree
dipole: 3.7329 -2.2561 0.7337
dipole: 4.4230
quadrupole: -99.8497 -88.8729 -84.6778
quadrupole: 9.2715 -3.3192 1.7353
quadrupole: -8.7163 2.2606 6.4557 9.2715 -3.3192 1.7353
hfenergy: -1000.9845054 hartree
pointgroup: C01 [X(C10H17Cl1O2)]
dipole: 1.486509 -0.8468409 0.3181276 debye
polarizability: 163.3228733|-3.7879631|108.7926132|1.3894369|-3.7873218|89.9759281 unknown
InChI: InChI=1S/C10H17ClO2/c11-8-10(12)13-7-6-9-4-2-1-3-5-9/h9H,1-8H2
charge 0 multiplicity 1
30 atoms
Cl -6.066454 -0.078343 0.002093
O  -2.065831 -0.58755 0.176629
O  -3.323598 1.227288 -0.591106
C  1.739876 -0.249821 -0.231287
C  2.141765 1.077766 0.467658
C  2.828928 -1.32945 0.007535
C  3.54706 1.55903 0.032151
C  4.231624 -0.852137 -0.433553
C  4.620071 0.470388 0.269012
C  0.355931 -0.780321 0.225305
C  -0.799245 0.146678 -0.151888
C  -3.256219 0.083705 -0.105191
C  -4.400719 -0.847531 0.287588
H  1.694329 -0.055661 -1.326936
H  2.13281 0.916519 1.567063
H  1.398689 1.871471 0.254991
H  2.55642 -2.259682 -0.530042
H  2.852163 -1.580767 1.089407
H  3.524404 1.818802 -1.046766
H  3.812971 2.485687 0.576911
H  4.983723 -1.636127 -0.219293
H  4.236533 -0.695747 -1.532426
H  5.607043 0.821351 -0.0898
H  4.720427 0.288099 1.359293
H  0.359318 -0.938986 1.321737
H  0.174053 -1.767972 -0.242235
H  -0.802379 1.095366 0.41254
H  -0.809677 0.383171 -1.232389
H  -4.330748 -1.101194 1.355785
H  -4.355867 -1.770528 -0.309783
