program: Gaussian 09
title: 000284386
version: EM64L-G09RevD.01
frameworkgroup: C1[X(C10H15NO7S3)]
method: RPBEPBE
basis: SDD
operation: Freq
keyword: #p
keyword: freq=noraman
keyword: PBEPBE/SDD
title: #p freq=noraman PBEPBE/SDD
converged: YES YES NO NO
title: Mulliken charges:
elementType: S S S O O O O O O O N C C C C C C C C C C H H H H H H H H H H H H H H H
charge: 0.948523 0.986344 1.010402 -0.363465 -0.509059 -0.506891 -0.541827 -0.575219 -0.495191 -0.529180 -0.456140 0.002128 0.431922 0.311853 -0.748148 -0.754127 -0.410361 -0.328122 -0.782816 -0.187588 -0.751567 0.286344 0.290053 0.322416 0.277869 0.292281 0.336327 0.248856 0.281159 0.283211 0.245472 0.216466 0.240545 0.281198 0.358095 0.288234
chargesum: 0.00000
title: Mulliken charges with hydrogens summed into heavy atoms:
elementType: S S S O O O O O O O N C C C C C C C C C C
charge: 0.948523 0.986344 1.010402 -0.363465 -0.509059 -0.506891 -0.541827 -0.575219 -0.495191 -0.529180 -0.456140 0.002128 0.431922 0.311853 0.150665 0.152350 -0.161504 -0.046963 -0.037666 0.052957 0.175960
polarizability: 3.35154106e+02 -2.83726641e+00 2.85943475e+02 -1.98175777e+00 1.36889468e+01 1.93582151e+02
1716.lowfreq: -13.9958 -9.2016 -5.7295 -0.0022 -0.0016 -0.0012 1.7065 39.2835 40.7742
frequency: -9.5374 39.1440 40.7374 50.2192 53.1553 79.8074 89.8175 91.5613 105.3039 109.5224 126.0125 132.6798 137.4109 151.4787 157.0735 165.5509 169.7157 184.0156 187.0593 189.1754 197.0146 211.2725 231.9964 238.4670 248.4467 258.4386 294.4961 310.3356 316.3075 334.2327 340.2542 351.6961 360.4471 373.5386 405.8959 437.9637 494.1057 501.7913 532.5760 546.3028 557.5670 564.8905 580.4355 597.4974 694.3306 742.4232 797.1223 806.5275 811.2556 826.0711 830.5072 886.8299 895.8758 902.3396 906.3754 947.5777 975.6982 985.1002 985.6060 999.0198 1021.0795 1024.8267 1033.2515 1047.8988 1050.9382 1081.0308 1176.0631 1181.2373 1225.2266 1248.9010 1304.6799 1310.2085 1316.6034 1348.6408 1366.7341 1400.7916 1404.0012 1407.5142 1410.4967 1421.6833 1427.6714 1431.5144 1434.8832 1452.7061 1476.4836 1539.4433 1570.5260 2990.0115 3006.8368 3010.1116 3023.5530 3071.4152 3102.1530 3137.6862 3154.4030 3157.2155 3160.7289 3178.2704 3178.8846 3185.9346 3186.0553 3188.4369
redmass: 8.9181 5.9594 5.5299 5.7280 6.3203 7.5093 5.7818 7.3285 6.6937 5.5821 10.4841 6.4450 1.1640 2.7319 3.7937 3.5504 4.3444 1.3597 1.6606 2.0410 1.1718 6.3974 4.0730 3.8680 3.9529 4.1686 7.8962 6.7164 7.2537 5.1024 6.5939 10.3053 9.7750 8.3007 5.4964 9.4950 6.1046 5.2510 4.5635 6.2679 5.7826 7.9512 7.9789 5.9463 7.3289 2.8449 1.7294 13.0546 13.0450 8.5256 6.2576 5.2316 4.2828 1.9871 2.2430 2.8164 1.2327 1.3674 1.2780 1.2689 2.0020 1.5688 1.5055 1.5503 1.5562 1.9912 1.2797 3.3761 4.6993 2.3042 1.1242 1.1256 1.1271 7.5233 2.4844 1.0509 1.0474 1.0918 1.1936 1.0584 2.0515 1.0560 1.0562 1.0861 1.1136 5.9051 4.8503 1.0381 1.0264 1.0253 1.0232 1.0949 1.1009 1.0880 1.1071 1.0925 1.1074 1.0984 1.1084 1.1084 1.1079 1.1079
irintensity: 1.8970 0.8735 1.0758 2.2823 1.7896 2.5984 3.8825 8.7894 4.5339 0.5376 1.3710 1.6549 5.9719 5.3005 1.4210 4.2757 3.7015 1.1845 5.1386 11.5726 1.6856 4.6792 10.1213 0.7599 0.4102 0.5198 8.1271 15.9513 28.3825 23.6815 53.7269 74.6414 32.0422 23.1580 31.0626 2.6702 12.0608 6.2628 0.8599 9.5021 13.5209 12.3645 21.9670 7.8578 6.4210 10.8842 19.1905 72.0189 47.9942 67.6326 25.0861 28.8537 38.0882 30.9063 21.5427 5.0973 82.2543 6.1542 21.3460 64.5704 0.3858 9.8841 83.2979 6.8294 36.0288 1.3734 2.5243 14.4897 2.8984 10.3933 3.6942 5.3610 9.9383 9.2651 3.1662 17.1780 6.7851 2.8892 33.8846 14.8715 21.0054 8.8406 12.2359 22.7971 30.3063 3.7554 38.6590 12.6013 7.1920 18.4912 1.9879 9.7092 21.1054 4.8016 10.1978 15.7854 20.8571 6.8269 0.0705 0.7621 1.9049 0.2490
temp: 298.150 k
press: 1.00000 atm
elementType: 16 16 16 8 8 8 8 8 8 8 7 6 6 6 6 6 6 6 6 6 6 1 1 1 1 1 1 1 1 1 1 1 1 1 1 1
symmnumber: 1
zpe: 642303.7 jmol-1
zpe.correction: 0.244641 hartree
zpe.thermalcorrener: 0.270456 hartree
zpe.thermalcorrenthalpy: 0.271400 hartree
zpe.thermalcorrgfe: 0.189370 hartree
zpe.sumelectzpe: -2163.432623 hartree
zpe.sumelectthermal: -2163.406808 hartree
zpe.sumelectthermalent: -2163.405864 hartree
zpe.sumelectthermalfe: -2163.487894 hartree
dipole: 2.5730 -0.0297 0.7064
dipole: 2.6684
quadrupole: -165.0446 -132.8380 -140.5499
quadrupole: -10.2655 -5.8216 13.0780
quadrupole: -18.9004 13.3062 5.5943 -10.2655 -5.8216 13.0780
hfenergy: -2163.6772638 hartree
pointgroup: C01 [X(C10H15N1O7S3)]
dipole: -0.8516001 -0.1204981 -0.60201 debye
polarizability: 317.8534747|9.0261567|289.9078613|43.9854893|4.456049|206.9183959 unknown
InChI: InChI=1S/C8H9NO3S.2CH3O2S/c1-6-4-3-5-7(10)8(6)9-13(2,11)12;2*1-4(2)3/h3-5H,1-2H3;2*1H3
charge 0 multiplicity 1
36 atoms
S  1.890191 -0.547826 1.935906
S  0.854478 -1.885733 -0.94154
S  -3.170739 -1.051925 -0.745244
O  -1.661107 -0.466847 0.540601
O  0.73122 0.109067 2.881429
O  3.412534 0.021581 2.030558
O  2.366021 -2.482223 -0.855789
O  -0.327214 -2.896938 -0.43276
O  -4.495445 -0.160994 -0.452286
O  -2.610163 -1.123685 -2.271984
N  1.195976 -0.093196 -0.131641
C  0.245576 0.931161 -0.009794
C  0.808058 2.26386 -0.115199
C  -1.158929 0.788259 0.33552
C  1.928175 -2.441819 2.253288
C  0.488944 -1.351075 -2.735358
C  -0.053579 3.370975 0.027675
C  -1.987666 1.934365 0.476712
C  2.291163 2.460625 -0.344396
C  -1.434956 3.213978 0.312871
C  -3.319151 -2.777726 0.030888
H  2.273562 -2.539743 3.292493
H  0.898018 -2.793199 2.100627
H  2.6217 -2.847614 1.504924
H  1.21856 -0.563229 -2.963248
H  0.654055 -2.261897 -3.328977
H  -0.561113 -1.021076 -2.753233
H  0.366691 4.37743 -0.075417
H  -3.044552 1.792571 0.721117
H  2.867005 2.210981 0.56623
H  2.67236 1.788479 -1.131958
H  2.50851 3.506811 -0.616825
H  -2.070214 4.098946 0.423475
H  -4.061458 -3.318082 -0.573274
H  -2.296904 -3.18059 -0.035626
H  -3.649206 -2.599472 1.06273
