program: Gaussian 09
title: 000284427
version: EM64L-G09RevD.01
frameworkgroup: C1[X(C15H12N2O4S)]
method: RPBEPBE
basis: SDD
operation: Freq
keyword: #p
keyword: freq=noraman
keyword: PBEPBE/SDD
title: #p freq=noraman PBEPBE/SDD
converged: YES YES NO NO
title: Mulliken charges:
elementType: S O O O O N N C C C C C C C C C C C C C C C H H H H H H H H H H H H
charge: 0.836396 -0.524241 -0.525475 -0.199411 -0.198789 -0.078806 0.028610 -0.391513 -0.760550 0.311035 0.481363 0.288569 -0.344227 -0.348402 -0.324166 -0.367489 -0.359637 -0.345833 0.384278 -0.246908 -0.226157 -0.225996 0.243502 0.267688 0.292735 0.245963 0.279786 0.253290 0.259694 0.293037 0.292116 0.240004 0.233206 0.236327
chargesum: 0.00000
title: Mulliken charges with hydrogens summed into heavy atoms:
elementType: S O O O O N N C C C C C C C C C C C C C C C
charge: 0.836396 -0.524241 -0.525475 -0.199411 -0.198789 -0.078806 0.028610 -0.148011 -0.200127 0.311035 0.481363 0.288569 -0.098264 -0.068616 -0.070876 -0.107795 -0.066600 -0.053716 0.384278 -0.006905 0.007050 0.010331
polarizability: 4.19258218e+02 -1.56099700e+01 2.93986512e+02 -2.20700432e+00 1.64757398e+00 1.24324116e+02
1716.lowfreq: -14.9455 -3.8269 -2.9165 -1.5693 -0.0016 -0.0013 -0.0010 21.4618 25.9154
frequency: -13.6740 21.4052 25.8854 27.6204 31.4183 60.9503 63.1895 75.9862 86.1621 111.7816 136.2217 152.1671 171.0802 199.1346 212.3765 217.9861 244.6925 319.1381 329.6639 371.1824 377.6170 396.9084 401.1799 411.3121 445.5992 490.5484 500.9907 543.4494 584.4426 612.9011 623.1199 646.3650 660.3273 667.5100 689.7313 731.4837 745.1007 757.2681 785.5202 789.3592 819.1825 844.6447 852.3724 853.9975 873.4819 900.1536 928.5028 930.6882 949.1352 977.1223 980.7132 988.8189 998.0274 1002.9400 1003.9851 1010.5552 1023.0812 1083.4292 1089.9019 1104.4807 1112.1352 1174.1175 1176.2797 1196.2432 1212.6872 1225.2200 1270.0532 1297.6140 1325.8873 1361.6643 1381.2910 1384.3309 1395.7238 1411.5511 1426.8487 1438.3987 1477.2336 1482.9813 1533.3082 1579.1741 1588.6727 1603.7010 1608.1465 1627.8731 2977.3617 3122.3653 3133.0332 3139.6654 3144.4337 3155.9060 3163.5471 3165.1273 3174.4024 3185.6907 3187.9423 3231.0572
redmass: 13.9540 6.9482 6.6509 5.8851 7.3850 7.6710 7.0989 6.3836 8.0777 11.2613 6.8545 5.9951 7.3128 5.5168 6.1444 5.9949 4.6916 3.9458 4.6586 16.9126 7.2150 4.0391 2.7724 2.8968 3.7687 3.2018 7.2680 4.9718 4.4874 6.4280 6.7744 5.4685 4.4068 4.3163 1.6532 1.6190 2.9612 5.1613 2.5457 2.9791 13.2784 1.2778 1.6349 2.5239 1.4663 12.8487 1.6480 1.5289 1.4744 1.5830 1.5379 4.1184 1.4677 2.7966 1.3641 1.3645 2.4271 1.8013 3.2749 1.6601 1.5540 1.2589 1.0728 1.1626 4.8080 3.2535 1.6957 1.3900 1.3558 4.7334 3.6426 4.7792 2.0188 5.3735 2.6866 2.1108 2.1887 2.5997 2.8618 5.8149 8.2024 6.1413 6.0362 8.1211 1.0877 1.0593 1.0855 1.0910 1.0885 1.0928 1.0897 1.0959 1.1010 1.0949 1.0961 1.1151
irintensity: 2.8307 1.7086 0.7119 0.9827 0.7789 0.5938 0.7219 1.5900 0.6786 1.9330 5.6877 11.3025 39.3083 5.2381 13.6915 16.4868 3.7348 5.1406 6.0576 20.7341 2.2310 0.4509 0.8026 0.2463 7.4387 20.4449 1.9606 6.2152 12.5382 0.5970 0.8041 1.8880 4.3783 23.2469 57.1840 8.6049 4.6823 22.2636 65.8862 80.0007 92.9101 3.6430 17.8067 14.6485 38.8885 60.9720 64.3190 17.7253 46.7113 21.5716 1.3631 2.7640 3.2162 5.8996 0.3667 0.3227 9.6673 23.4440 25.4550 6.0312 12.7858 15.0582 7.9452 58.9508 498.5908 4.9858 72.0014 1.6431 15.6891 32.4095 90.7555 43.2791 18.6488 22.5498 21.2781 18.1966 10.9624 3.3566 169.1473 3.8214 23.2947 23.9100 20.1116 157.1687 18.4249 8.3645 0.5272 5.2812 5.9675 17.8072 0.6936 12.6518 22.0200 0.4024 1.9769 2.5375
temp: 298.150 k
press: 1.00000 atm
elementType: 16 8 8 8 8 7 7 6 6 6 6 6 6 6 6 6 6 6 6 6 6 6 1 1 1 1 1 1 1 1 1 1 1 1
symmnumber: 1
zpe: 628073.3 jmol-1
zpe.correction: 0.239220 hartree
zpe.thermalcorrener: 0.259354 hartree
zpe.thermalcorrenthalpy: 0.260299 hartree
zpe.thermalcorrgfe: 0.186215 hartree
zpe.sumelectzpe: -1385.493634 hartree
zpe.sumelectthermal: -1385.473500 hartree
zpe.sumelectthermalent: -1385.472556 hartree
zpe.sumelectthermalfe: -1385.546639 hartree
dipole: 0.6226 2.3873 -0.2367
dipole: 2.4785
quadrupole: -187.0795 -131.7513 -136.9869
quadrupole: 24.2271 -0.6903 2.5536
quadrupole: -35.1403 20.1880 14.9523 24.2271 -0.6903 2.5536
hfenergy: -1385.7328545 hartree
pointgroup: C01 [X(C15H12N2O4S1)]
dipole: -0.4909178 -0.8378134 -0.089077 debye
polarizability: 396.1545291|-44.3838547|310.8286359|36.8077368|-21.3257789|130.5856815 unknown
InChI: InChI=1S/C15H12N2O2.O2S/c1-12(14-5-3-2-4-6-14)16-11-13-7-9-15(10-8-13)17(18)19;1-3-2/h2-11H,1H2;
charge 0 multiplicity 1
34 atoms
S  -2.356825 3.712247 -0.948811
O  -2.76755 4.922641 0.066002
O  -3.625876 3.076846 -1.757306
O  6.54989 -0.978027 0.169069
O  5.658421 -2.769311 1.266854
N  -0.784816 0.077917 0.533106
N  5.553546 -1.634814 0.660535
C  0.298859 0.66597 0.105608
C  -2.254269 1.916226 1.111655
C  -2.063665 0.66101 0.53966
C  1.634126 0.060541 0.254067
C  -3.157593 -0.178374 -0.005027
C  2.767393 0.742156 -0.269062
C  1.808062 -1.189207 0.914459
C  -4.419312 0.389105 -0.348153
C  -2.942981 -1.570403 -0.224048
C  4.056651 0.193682 -0.140619
C  3.088102 -1.749051 1.050631
C  4.195328 -1.046458 0.519002
C  -5.439112 -0.423204 -0.883098
C  -3.968666 -2.376735 -0.75337
C  -5.22244 -1.806645 -1.082966
H  0.257112 1.65052 -0.403168
H  -1.423131 2.445191 1.588068
H  -3.257479 2.289567 1.33185
H  2.635481 1.704069 -0.777937
H  0.925155 -1.697818 1.312924
H  -4.598785 1.46259 -0.238193
H  -1.974054 -2.003716 0.041223
H  4.943838 0.696411 -0.533559
H  3.252018 -2.705807 1.553006
H  -6.39944 0.027231 -1.154391
H  -3.796101 -3.447451 -0.906769
H  -6.020889 -2.4340 -1.49424
