program: Gaussian 09
title: 000284334
version: EM64L-G09RevD.01
frameworkgroup: C1[X(C15H14N2O3)]
method: RPBEPBE
basis: SDD
operation: Freq
keyword: #p
keyword: freq=noraman
keyword: PBEPBE/SDD
title: #p freq=noraman PBEPBE/SDD
converged: YES YES NO NO
title: Mulliken charges:
elementType: O O O N N C C C C C C C C C C C C C C C H H H H H H H H H H H H H H
charge: -0.328305 -0.202979 -0.207976 -0.075471 0.020786 0.120779 0.358595 0.352032 -0.427088 -0.417641 0.479401 -0.219405 -0.314992 -0.807433 -0.807334 -0.504858 -0.408899 0.372508 -0.185055 -0.367224 0.241072 0.240275 0.270401 0.231438 0.268116 0.225259 0.237298 0.231286 0.253829 0.243449 0.282302 0.316766 0.241097 0.287973
chargesum: 0.00000
title: Mulliken charges with hydrogens summed into heavy atoms:
elementType: O O O N N C C C C C C C C C C C C C C C
charge: -0.328305 -0.202979 -0.207976 -0.075471 0.020786 0.120779 0.358595 0.352032 -0.186016 -0.177366 0.479401 0.012033 -0.044591 -0.076761 -0.078770 -0.222557 -0.092133 0.372508 0.056042 -0.079251
polarizability: 3.16654505e+02 -9.17316842e+00 1.70235317e+02 -7.91844002e+00 6.91713736e+00 1.35943969e+02
1716.lowfreq: -9.1106 -4.8213 -0.0007 -0.0006 -0.0005 3.6399 15.6862 35.0473 54.0992
frequency: 15.6065 35.0060 54.0759 58.6341 72.4660 93.9336 108.5487 123.1885 158.5039 168.8731 181.7822 194.1731 222.5254 253.3550 305.1717 307.2021 324.7558 388.3528 399.4484 421.3485 435.2330 497.7003 509.8651 512.9529 520.5768 537.7193 579.8091 606.1285 654.1283 657.4705 688.7889 702.9488 727.8572 740.7568 776.2299 784.1889 812.2658 828.0847 865.3903 895.2953 901.4646 919.9919 936.3263 957.7991 982.5383 982.8351 988.6779 1013.1180 1045.0063 1045.9713 1049.7812 1052.7033 1085.8280 1090.6046 1097.6718 1165.4176 1174.4481 1180.3435 1214.0159 1240.1913 1260.6663 1272.3657 1301.6620 1370.5443 1371.0896 1378.2029 1398.3586 1401.8864 1403.7480 1426.0220 1435.6280 1456.0301 1464.6037 1467.8635 1470.9116 1481.9192 1485.5375 1551.2690 1569.7639 1598.6292 1607.2392 1610.8503 2983.3006 2984.4686 3063.0978 3064.1383 3095.5277 3099.1294 3128.5427 3139.0707 3152.0900 3156.0030 3161.4685 3161.6182 3184.0975 3189.7960
redmass: 4.4750 5.6822 5.3066 8.7868 4.2290 1.1949 2.7180 1.1594 4.8617 5.1051 4.9384 5.6891 2.8943 5.1186 3.7908 4.5029 4.6216 4.8719 8.6731 3.0327 3.2944 5.7806 5.2196 3.2297 6.2636 4.5241 4.3082 4.9081 7.6522 6.5089 2.1332 5.2378 7.0355 4.9112 5.3006 1.2984 1.3662 1.4226 6.4755 5.0260 1.3096 2.5891 1.5962 1.3690 5.0194 1.4131 1.6192 1.3566 1.7097 1.6475 1.5720 3.2345 1.8000 1.7048 1.8236 2.9283 1.1881 1.1670 6.0600 3.2044 1.5811 3.2053 1.3912 6.4608 7.0480 4.0995 1.8065 1.3625 1.3975 2.8548 3.1344 1.9132 1.1448 2.0698 1.0976 1.2396 1.2318 6.1589 6.1727 5.6111 7.9457 7.0254 1.0382 1.0379 1.0964 1.0963 1.0994 1.0997 1.0861 1.0922 1.0894 1.0911 1.0992 1.0920 1.0927 1.0977
irintensity: 0.0810 0.2263 0.5181 2.4713 5.1193 1.4839 1.8182 0.5659 2.8734 4.3197 0.8691 2.4587 0.0246 8.5608 0.1860 2.3279 1.3485 5.8579 2.4018 0.4797 0.2226 18.0950 0.3782 0.3378 2.0427 7.6400 6.8012 11.5906 17.7152 0.9654 32.5975 11.9048 4.6901 4.4589 1.4630 67.5074 0.3089 48.9299 29.0381 3.6131 0.0125 1.9329 33.0115 0.4343 0.5178 0.4747 6.3726 2.7211 3.1303 2.9852 0.8201 30.6575 14.1183 16.7943 44.1282 56.8352 41.1673 1.9202 220.9078 60.7754 0.1905 2.0103 1.5345 27.1041 40.2331 59.7577 34.8877 20.8453 10.2252 13.8044 16.5120 0.6815 15.0541 17.3888 18.5828 29.7567 40.6362 74.4725 0.4017 1.0145 8.3036 2.8517 23.6013 12.3178 12.0576 14.2648 20.7219 21.4503 0.0893 19.0920 10.4969 7.3117 34.9646 3.4484 10.9446 2.3788
temp: 298.150 k
press: 1.00000 atm
elementType: 8 8 8 7 7 6 6 6 6 6 6 6 6 6 6 6 6 6 6 6 1 1 1 1 1 1 1 1 1 1 1 1 1 1
symmnumber: 1
zpe: 680030.5 jmol-1
zpe.correction: 0.259010 hartree
zpe.thermalcorrener: 0.277319 hartree
zpe.thermalcorrenthalpy: 0.278263 hartree
zpe.thermalcorrgfe: 0.210453 hartree
zpe.sumelectzpe: -913.622504 hartree
zpe.sumelectthermal: -913.604194 hartree
zpe.sumelectthermalent: -913.603250 hartree
zpe.sumelectthermalfe: -913.671061 hartree
dipole: 4.7641 0.3993 0.3073
dipole: 4.7907
quadrupole: -130.4028 -118.2044 -113.2419
quadrupole: -21.1216 -11.6429 -6.7851
quadrupole: -9.7864 2.4120 7.3745 -21.1216 -11.6429 -6.7851
hfenergy: -913.8815135 hartree
pointgroup: C01 [X(C15H14N2O3)]
dipole: 1.8672534 0.0645271 -0.2482918 debye
polarizability: 315.4850027|-19.1499513|142.400594|-3.6301466|-13.1124421|164.9481949 unknown
InChI: InChI=1S/C15H14N2O3/c1-11-5-3-6-12(2)15(11)16(18)10-13-7-4-8-14(9-13)17(19)20/h3-10H,1-2H3
charge 0 multiplicity 1
34 atoms
O  1.229794 1.308718 -1.554438
O  -5.858189 -0.238003 1.091738
O  -4.224963 -1.353718 2.225033
N  1.232671 0.451566 -0.528248
N  -4.621246 -0.537954 1.305291
C  2.563661 -0.025712 -0.09851
C  3.191901 -1.028286 -0.882041
C  3.171572 0.586013 1.027433
C  4.480506 -1.452712 -0.477422
C  4.46401 0.13195 1.39046
C  -1.236194 0.37019 -0.158339
C  5.110268 -0.881806 0.650834
C  0.141588 0.001006 0.118266
C  2.517662 -1.60415 -2.112019
C  2.484904 1.695417 1.803742
C  -2.241988 -0.225595 0.65851
C  -1.640959 1.284719 -1.18524
C  -3.591516 0.09491 0.440102
C  -3.007365 1.582924 -1.374579
C  -4.004127 0.995363 -0.568484
H  4.990573 -2.230306 -1.056862
H  4.963849 0.585064 2.253835
H  0.35194 -0.707757 0.924302
H  6.109254 -1.219909 0.946851
H  2.314785 -0.808302 -2.851015
H  3.152326 -2.370779 -2.585458
H  1.544216 -2.069418 -1.867608
H  3.197889 2.192748 2.481913
H  2.064262 2.459323 1.125438
H  1.649783 1.312773 2.420063
H  -1.986653 -0.930154 1.456394
H  -0.867723 1.737958 -1.809013
H  -3.298485 2.284254 -2.163246
H  -5.067102 1.212765 -0.69888
