program: Gaussian 09
title: 000284296
version: EM64L-G09RevD.01
frameworkgroup: C1[X(C14H18)]
method: RPBEPBE
basis: SDD
operation: Freq
keyword: #p
keyword: freq=noraman
keyword: PBEPBE/SDD
title: #p freq=noraman PBEPBE/SDD
converged: YES YES NO NO
title: Mulliken charges:
elementType: C C C C C C C C C C C C C C H H H H H H H H H H H H H H H H H H
charge: -0.365642 -0.392844 -0.400808 -0.408438 -0.569442 -0.466799 0.381677 -0.357678 0.337132 -0.414616 -0.415689 -0.233221 -0.233485 -0.247179 0.186925 0.194748 0.210775 0.197287 0.200121 0.213263 0.199379 0.203244 0.198486 0.205507 0.199080 0.202911 0.235659 0.242096 0.224862 0.222902 0.222364 0.227424
chargesum: 0.00000
title: Mulliken charges with hydrogens summed into heavy atoms:
elementType: C C C C C C C C C C C C C C
charge: 0.016030 0.015218 0.012576 -0.005814 -0.165449 -0.064808 0.381677 -0.122019 0.337132 -0.172520 -0.190826 -0.010319 -0.011121 -0.019756
polarizability: 2.00644643e+02 -1.18219080e+01 1.37737525e+02 -1.23301806e+01 -1.03509270e+01 1.07224262e+02
1716.lowfreq: -12.9384 -6.3190 -0.0008 -0.0005 -0.0004 11.0601 50.0114 58.2467 97.8969
frequency: 49.7308 58.1613 97.8664 156.6946 193.6130 212.5644 237.0307 256.5876 315.8521 356.9503 376.9583 406.5825 420.1235 432.4486 500.7275 519.0379 573.9187 613.7734 627.0189 700.9608 705.1024 733.0419 766.0592 778.3234 827.3627 847.1198 852.8746 870.8973 893.1091 900.9825 917.3433 971.8748 979.5937 987.5590 991.3150 1000.4386 1014.8231 1021.8639 1031.4185 1081.5013 1089.2010 1103.9715 1127.9750 1146.8559 1171.3117 1177.0664 1191.1711 1200.0719 1240.0323 1255.0401 1272.5352 1280.8066 1304.0738 1309.6416 1315.4549 1331.1841 1338.4039 1346.3332 1352.4687 1363.6906 1375.1183 1431.5030 1459.8044 1460.1420 1463.6714 1470.8170 1472.5748 1481.1513 1490.4516 1578.1047 1607.6645 1646.5854 2957.4147 2960.5900 2965.5988 2976.1235 2983.7200 2985.2737 3010.0624 3017.2256 3024.8264 3034.0083 3040.7701 3043.9065 3095.4473 3119.0252 3124.0988 3137.9051 3145.5754 3162.3444
redmass: 3.5558 3.9544 3.2768 2.8283 2.7077 2.7764 3.1362 2.3074 2.8892 3.3175 2.1019 2.8115 2.6930 1.7750 3.0270 2.3297 2.9568 5.2414 3.1039 1.8346 2.7642 2.0044 1.8870 1.6927 2.1590 1.2508 1.7346 1.9051 1.7217 2.1336 1.5022 1.4203 1.8023 5.4130 1.3221 2.6904 1.8710 2.4530 2.0323 1.6573 2.0171 2.1065 2.2211 1.3273 1.0559 1.2169 1.1667 1.3978 1.2262 1.2245 1.1867 1.8487 1.3477 1.3841 1.2531 1.3962 1.3568 1.4317 1.5256 1.4885 4.7550 2.2786 1.0837 1.0841 1.1076 1.0880 1.1041 2.1980 1.1052 5.7362 6.1047 7.0659 1.0601 1.0594 1.0628 1.0631 1.0640 1.0617 1.0998 1.0973 1.0997 1.1002 1.1017 1.0981 1.0905 1.0841 1.0870 1.0917 1.0962 1.1016
irintensity: 0.0573 0.3847 0.1375 0.7710 0.2627 0.0896 0.1290 0.0538 0.6156 0.8197 0.4666 0.0519 0.5355 0.7420 10.0974 4.0960 1.2988 0.4481 3.3829 42.1126 8.8576 2.7753 58.3942 21.7047 2.5885 0.1078 8.5274 3.5125 11.7353 0.9092 1.0187 0.2996 1.8439 0.0750 0.0604 1.8213 1.8893 10.0174 1.8406 9.4811 1.0740 3.1452 1.2895 2.9315 0.1702 3.3691 0.1986 1.7021 1.6460 0.5598 3.4346 2.3192 2.1465 1.5143 1.4514 0.4775 1.0533 0.2792 5.8213 0.1265 1.4596 5.6076 1.8390 5.8237 9.0347 11.8007 2.1058 24.2488 26.1096 1.8570 11.6867 3.1737 39.7333 16.3362 47.0403 44.4301 30.3178 44.9462 30.7410 45.8200 62.7786 88.6705 53.8589 39.5315 31.1496 5.3813 0.2518 17.9193 47.6199 23.9089
temp: 298.150 k
press: 1.00000 atm
elementType: 6 6 6 6 6 6 6 6 6 6 6 6 6 6 1 1 1 1 1 1 1 1 1 1 1 1 1 1 1 1 1 1
symmnumber: 1
zpe: 735212.9 jmol-1
zpe.correction: 0.280028 hartree
zpe.thermalcorrener: 0.292444 hartree
zpe.thermalcorrenthalpy: 0.293388 hartree
zpe.thermalcorrgfe: 0.241390 hartree
zpe.sumelectzpe: -543.226830 hartree
zpe.sumelectthermal: -543.214414 hartree
zpe.sumelectthermalent: -543.213470 hartree
zpe.sumelectthermalfe: -543.265468 hartree
dipole: 0.6935 0.1907 0.2620
dipole: 0.7655
quadrupole: -79.4375 -80.8977 -87.4079
quadrupole: -0.8239 -1.7296 -3.5553
quadrupole: 3.1436 1.6834 -4.8269 -0.8239 -1.7296 -3.5553
hfenergy: -543.5068577 hartree
pointgroup: C01 [X(C14H18)]
dipole: 0.2735365 -0.1251756 0.0144122 debye
polarizability: 200.4973364|17.4028917|106.4306172|-2.9448858|-8.4664636|138.6784761 unknown
InChI: InChI=1S/C14H18/c1-2-5-9-13(10-6-3-1)14-11-7-4-8-12-14/h4,7-9,11-12H,1-3,5-6,10H2
charge 0 multiplicity 1
32 atoms
C  3.025142 -1.325573 0.539029
C  2.988888 -0.809064 -0.929918
C  1.649186 -1.493271 1.241989
C  3.293314 0.699251 -1.120419
C  0.876542 -0.186103 1.599254
C  2.422046 1.65984 -0.250981
C  0.233408 0.517845 0.403465
C  0.943523 1.379675 -0.3894
C  -1.20038 0.217095 0.089993
C  -1.637454 0.096578 -1.261429
C  -2.175126 0.050815 1.114476
C  -2.989224 -0.157993 -1.575593
C  -3.528397 -0.204316 0.802989
C  -3.945208 -0.309692 -0.544167
H  3.674511 -0.666557 1.152757
H  3.51275 -2.320996 0.550601
H  1.998019 -1.041821 -1.365694
H  3.729453 -1.372092 -1.532522
H  1.816834 -2.049232 2.187588
H  0.997887 -2.135071 0.614739
H  3.157633 0.95382 -2.191423
H  4.359336 0.893465 -0.882265
H  1.570079 0.497585 2.126963
H  0.09469 -0.458778 2.331838
H  2.644623 2.702528 -0.549641
H  2.736003 1.55727 0.805227
H  0.425833 1.876768 -1.222476
H  -0.900613 0.179331 -2.068589
H  -1.88258 0.151463 2.165731
H  -3.294809 -0.252335 -2.62413
H  -4.259081 -0.315928 1.612425
H  -4.99453 -0.512909 -0.785518
