program: Gaussian 09
title: 000284295
version: EM64L-G09RevD.01
frameworkgroup: C1[X(C15H20O)]
method: RPBEPBE
basis: SDD
operation: Freq
keyword: #pfreq=noraman
keyword: PBEPBE/SDD
title: #p freq=noraman PBEPBE/SDD
converged: YES YES NO NO
title: Mulliken charges:
elementType: O C C C C C C C C C C C C C C C H H H H H H H H H H H H H H H H H H H H
charge: -0.275964 -0.362944 -0.405020 -0.391489 -0.585189 -0.409365 -0.461436 0.404474 -0.360193 0.186422 0.169646 -0.383479 -0.368177 -0.259598 -0.239919 -0.540060 0.186294 0.191279 0.198555 0.208868 0.206881 0.195056 0.191312 0.250687 0.197883 0.201684 0.196889 0.204366 0.237520 0.246621 0.235771 0.224761 0.223451 0.222861 0.243684 0.217867
chargesum: 0.00000
title: Mulliken charges with hydrogens summed into heavy atoms:
elementType: O C C C C C C C C C C C C C C C
charge: -0.275964 0.014629 0.002403 0.010448 -0.143190 -0.009798 -0.060180 0.404474 -0.122673 0.186422 0.169646 -0.136857 -0.132406 -0.034837 -0.016468 0.144352
polarizability: 2.07970811e+02 -6.82076197e-01 1.65897537e+02 1.54610838e+01 -2.51032195e+00 1.20847061e+02
1716.lowfreq: -12.4473 -8.1823 0.0001 0.0005 0.0007 12.2862 39.6387 58.6210 80.5091
frequency: 39.6118 58.2411 80.4949 98.5181 137.1721 143.7508 195.8072 211.3537 232.9458 247.2074 259.0903 275.6054 324.4856 347.6254 366.1136 378.8128 424.5198 464.5402 489.2015 523.2139 548.5449 560.4105 587.2405 630.9101 686.9786 730.5193 741.7608 753.5183 766.3943 781.6071 826.9220 844.9210 857.0196 872.5846 892.2278 899.3925 932.1801 969.6348 977.4215 985.6871 1001.7273 1013.7575 1023.8112 1047.1939 1086.0419 1094.8665 1111.0118 1117.0718 1128.0053 1146.5673 1152.9587 1171.7498 1177.6868 1194.6741 1214.9034 1236.1592 1250.1265 1264.8716 1272.7264 1286.6135 1303.5417 1315.0995 1328.4505 1336.3180 1344.5592 1351.4647 1360.1179 1373.5565 1424.1190 1441.4033 1457.5371 1460.7423 1465.4276 1467.2575 1467.9623 1468.8655 1474.3183 1484.2389 1492.7093 1581.3011 1599.0563 1651.9088 2955.3483 2958.0865 2959.6166 2964.6620 2975.0606 2984.0145 2986.3537 3008.1689 3015.1645 3022.7767 3032.1836 3040.4590 3045.7526 3067.1434 3092.9585 3122.0082 3126.7796 3137.2152 3155.0805 3168.2252
redmass: 3.4692 3.9451 3.4286 3.2975 4.0723 2.6614 2.2258 2.3332 2.8808 2.4211 1.6761 2.3087 2.7495 3.5532 2.4387 2.7955 1.7441 3.0100 3.0069 3.1117 3.5218 3.3680 3.8471 3.1693 3.1885 2.1458 2.7724 1.4163 2.7945 2.1531 2.0112 1.5076 1.7498 1.9229 1.7441 2.2316 1.3855 1.3245 1.8227 7.6756 2.7616 1.8592 2.4118 2.1146 1.9836 2.3314 1.2623 1.7788 2.2246 1.3400 1.3893 1.1410 1.2042 1.4427 2.9212 1.2856 1.2852 1.4005 1.1651 1.5313 1.3716 1.2688 1.4250 1.3751 1.4242 1.5549 1.4327 7.5449 1.6750 1.4538 1.0847 1.0804 1.1125 1.0541 1.1970 1.2187 1.0953 1.6312 1.0923 6.6455 6.4823 7.2050 1.0601 1.0331 1.0589 1.0624 1.0630 1.0632 1.0663 1.0997 1.0978 1.0995 1.1002 1.1015 1.1037 1.0947 1.0908 1.0992 1.0849 1.0902 1.0937 1.0993
irintensity: 0.7685 0.5669 2.7201 3.4749 1.4426 1.2404 0.0961 0.2079 0.4431 0.3961 0.9826 1.3319 0.4276 1.1975 0.1990 0.6433 0.5863 2.0624 3.0238 7.6883 2.1824 4.0608 2.2940 1.4925 3.0167 4.3867 13.2955 88.1834 7.2308 8.5071 2.9979 4.9749 8.2241 4.9402 11.1975 0.5689 1.4074 0.4843 4.8372 42.0219 1.1873 2.0202 6.0507 14.7930 1.1749 28.0006 0.2085 13.8124 0.9755 2.1721 0.5155 9.5166 4.3760 6.1328 122.8968 4.0549 5.3858 8.3229 3.9558 2.4425 1.7264 2.7298 0.4985 0.7096 0.1964 4.6152 0.5452 7.7908 27.3607 8.1507 2.9432 5.8146 6.2548 15.5656 16.4435 78.1635 5.4541 10.0943 23.9802 13.1318 17.6670 3.1123 36.8362 83.9884 12.7879 51.3931 43.9961 60.0403 10.0889 33.4302 39.3283 70.4918 96.4885 60.2625 46.4735 19.6040 29.8795 22.3206 0.3760 13.4510 29.2373 21.7924
temp: 298.150 k
press: 1.00000 atm
elementType: 8 6 6 6 6 6 6 6 6 6 6 6 6 6 6 6 1 1 1 1 1 1 1 1 1 1 1 1 1 1 1 1 1 1 1 1
symmnumber: 1
zpe: 817071.7 jmol-1
zpe.correction: 0.311206 hartree
zpe.thermalcorrener: 0.326374 hartree
zpe.thermalcorrenthalpy: 0.327318 hartree
zpe.thermalcorrgfe: 0.269200 hartree
zpe.sumelectzpe: -657.575782 hartree
zpe.sumelectthermal: -657.560614 hartree
zpe.sumelectthermalent: -657.559670 hartree
zpe.sumelectthermalfe: -657.617788 hartree
dipole: -1.2161 -0.8035 -0.3084
dipole: 1.4898
quadrupole: -83.1488 -89.9462 -100.0656
quadrupole: 5.2110 1.0976 0.0079
quadrupole: 7.9047 1.1073 -9.0120 5.2110 1.0976 0.0079
hfenergy: -657.8869883 hartree
pointgroup: C01 [X(C15H20O1)]
dipole: -0.4647834 -0.1858304 -0.3049738 debye
polarizability: 206.930381|-10.2518652|152.4037192|15.0433603|20.390016|135.3813091 unknown
InChI: InChI=1S/C15H20O/c1-16-15-12-8-7-11-14(15)13-9-5-3-2-4-6-10-13/h7-9,11-12H,2-6,10H2,1H3
charge 0 multiplicity 1
36 atoms
O  -1.936265 -1.601648 -0.754062
C  3.342008 0.295327 -1.311118
C  1.88451 0.172922 -1.836026
C  3.513939 0.956551 0.089055
C  0.963271 -0.868914 -1.131666
C  3.720404 -0.020389 1.275465
C  2.641101 -1.140054 1.40094
C  0.47187 -0.443687 0.253623
C  1.231382 -0.594154 1.381023
C  -0.85631 0.24332 0.348891
C  -2.061627 -0.323527 -0.176091
C  -0.959648 1.50551 0.988679
C  -3.297468 0.358538 -0.072856
C  -2.189612 2.19235 1.107946
C  -3.358562 1.617083 0.56846
C  -3.15173 -2.251094 -1.246574
H  3.818758 -0.707238 -1.314362
H  3.902876 0.896975 -2.054555
H  1.93307 -0.103341 -2.909944
H  1.401375 1.170453 -1.793615
H  2.632881 1.596367 0.291319
H  4.388997 1.636658 0.067104
H  1.506772 -1.832324 -1.069919
H  0.08766 -1.051079 -1.777226
H  3.744913 0.568524 2.215187
H  4.712558 -0.508201 1.182554
H  2.822409 -1.696609 2.341014
H  2.782104 -1.860584 0.572783
H  0.814413 -0.260023 2.342389
H  -0.041335 1.95559 1.3823
H  -4.213993 -0.083463 -0.474865
H  -2.22893 3.167695 1.604183
H  -4.319427 2.138647 0.642029
H  -3.888485 -2.395093 -0.432509
H  -2.819483 -3.229881 -1.623126
H  -3.617596 -1.673705 -2.069129
