program: Gaussian 09
title: 000284313
version: EM64L-G09RevD.01
frameworkgroup: C1[X(C15H22O3S2)]
method: RPBEPBE
basis: SDD
operation: Freq
keyword: #p
keyword: freq=noraman
keyword: PBEPBE/SDD
title: #p freq=noraman PBEPBE/SDD
converged: NO YES NO NO
title: Mulliken charges:
elementType: S S O O O C C C C C C C C C C C C C C C H H H H H H H H H H H H H H H H H H H H H H
charge: 1.045525 0.160021 -0.450919 -0.509435 -0.520746 -0.251885 -0.043069 -0.439385 -0.466716 -0.400386 -0.379272 -0.363909 0.564110 -0.519993 -0.372920 -0.191073 -0.248609 -0.247782 -0.729794 -0.840232 0.241659 0.268524 0.227005 0.200298 0.215677 0.234329 0.216231 0.192448 0.198882 0.225810 0.186594 0.193943 0.250543 0.257343 0.225166 0.231820 0.286346 0.283336 0.285023 0.260878 0.268379 0.256234
chargesum: 0.00000
title: Mulliken charges with hydrogens summed into heavy atoms:
elementType: S S O O O C C C C C C C C C C C C C C C
charge: 1.045525 0.160021 -0.450919 -0.509435 -0.520746 -0.010226 0.225455 -0.012082 -0.016710 0.008293 0.045419 0.016628 0.564110 -0.519993 -0.122377 0.066271 -0.023444 -0.015961 0.124912 -0.054741
polarizability: 2.49358381e+02 -3.66822334e+00 2.31031500e+02 1.16965628e+01 -1.09321318e+01 1.64556516e+02
1716.lowfreq: -12.5205 -8.4576 -0.0004 0.0017 0.0021 7.3986 17.0049 22.8907 29.2812
frequency: 16.3780 22.8613 29.1228 35.4368 61.3195 69.7159 89.4132 113.6509 119.3030 126.9539 140.9286 148.1950 169.5322 174.2205 201.8899 206.0748 222.9626 224.7283 281.3018 291.7451 316.3829 333.8451 337.2011 353.6092 386.9133 392.2810 402.4486 451.9660 481.1806 502.5356 538.5319 561.0913 598.5692 617.0874 641.2816 650.1616 684.7403 718.7159 749.1186 765.1589 772.9459 815.8230 831.5228 840.1835 863.0579 875.1715 884.3653 892.4322 909.7214 944.8077 959.6663 967.2150 980.3205 987.3356 991.5434 997.2933 1017.4860 1020.4506 1035.1649 1043.4909 1054.2162 1073.3652 1110.6581 1127.8496 1155.5586 1165.5365 1170.9433 1188.1676 1202.9892 1232.1064 1249.7799 1255.3873 1266.4429 1295.1350 1307.4833 1311.6179 1315.2216 1337.2146 1339.7067 1345.4055 1349.7654 1355.8846 1368.9568 1370.5731 1379.7539 1417.7845 1417.9916 1423.7915 1443.9950 1454.4380 1458.9952 1460.9994 1462.5808 1469.5542 1473.4405 1479.1596 1570.6996 1596.4776 2961.5648 2965.2927 2968.6068 2978.4984 2981.7068 2983.8051 2990.3201 3007.5214 3019.6569 3021.7516 3028.5798 3038.3857 3040.7002 3049.0311 3123.0765 3128.9751 3134.3928 3137.0836 3147.4900 3164.2051 3186.8201 3195.4708
redmass: 5.5357 3.6762 6.8925 4.2311 3.8115 4.1961 3.3776 3.7101 5.3828 1.0991 5.6636 2.6360 2.2593 1.1916 3.2745 3.8912 3.9857 4.6955 3.0150 5.5144 4.2155 4.0834 3.5605 4.9207 5.7084 3.5191 4.9758 2.2177 3.3526 5.8086 3.2332 3.4905 7.4913 4.1914 6.7856 4.5586 4.5729 2.0146 3.9718 1.2569 2.6361 3.5679 4.3938 2.1265 2.4926 1.8058 2.7643 1.8453 2.8141 2.2706 1.3870 1.1724 1.5052 1.2805 1.3391 1.5531 2.2411 4.7173 2.0019 2.2103 2.6630 1.7711 1.7611 1.9188 3.0374 1.3579 1.0818 1.4275 1.4023 1.3851 1.3129 1.2709 1.4256 1.3154 1.2008 1.1425 1.2555 1.4427 1.1703 1.5185 1.3610 1.3869 2.0813 1.5698 1.5643 1.0529 1.0520 2.0597 1.0645 2.2540 1.0590 1.0788 1.0945 1.0936 1.0954 1.0870 6.0999 6.3973 1.0622 1.0628 1.0633 1.0698 1.0659 1.0764 1.0818 1.0280 1.0997 1.0971 1.0959 1.0246 1.1014 1.1004 1.0852 1.1054 1.1043 1.0890 1.0946 1.1005 1.1077 1.1078
irintensity: 0.1824 2.6122 3.2693 0.1976 2.2374 0.5390 4.6692 1.8917 1.6782 0.0304 1.9327 5.3425 2.6301 1.5300 0.1657 0.2690 0.6434 0.8920 6.9261 5.9981 8.9285 2.8895 19.3875 9.6751 19.2143 1.1454 4.8675 11.1301 8.1381 45.5449 2.8979 15.9669 45.1199 1.3150 1.1825 10.8624 21.1333 1.0582 0.1075 80.2926 2.5386 36.0750 38.4870 19.0880 2.5130 15.1346 4.7305 7.4532 29.0408 1.7608 3.0474 7.3397 46.7469 15.7489 0.7407 15.2858 5.5237 10.5179 60.7872 5.6983 2.1427 2.0450 3.6986 6.0258 4.2923 7.5407 0.0365 2.2202 4.6888 7.1072 3.2392 1.8285 2.0446 8.0183 1.1455 3.8517 2.7128 2.4677 1.1824 4.6809 1.2220 0.8660 1.4433 0.0544 13.8810 12.7877 15.7423 8.2482 10.6415 26.3456 7.2626 3.8895 13.1289 21.7019 6.1998 11.5430 0.5599 3.6617 34.9022 9.6528 29.2835 15.9332 63.9843 29.9802 14.9729 32.5020 27.9783 73.4862 25.5567 0.0471 13.2828 78.6376 2.3518 16.7751 10.3815 8.2103 20.1989 25.7077 0.2515 0.1017
temp: 298.150 k
press: 1.00000 atm
elementType: 16 16 8 8 8 6 6 6 6 6 6 6 6 6 6 6 6 6 6 6 1 1 1 1 1 1 1 1 1 1 1 1 1 1 1 1 1 1 1 1 1 1
symmnumber: 1
zpe: 894633.9 jmol-1
zpe.correction: 0.340748 hartree
zpe.thermalcorrener: 0.363121 hartree
zpe.thermalcorrenthalpy: 0.364066 hartree
zpe.thermalcorrgfe: 0.286673 hartree
zpe.sumelectzpe: -1604.863820 hartree
zpe.sumelectthermal: -1604.841446 hartree
zpe.sumelectthermalent: -1604.840502 hartree
zpe.sumelectthermalfe: -1604.917895 hartree
dipole: -2.1013 -1.3410 4.3195
dipole: 4.9871
quadrupole: -138.3369 -121.5873 -142.0337
quadrupole: -9.4858 7.5866 -8.0102
quadrupole: -4.3509 12.3987 -8.0477 -9.4858 7.5866 -8.0102
hfenergy: -1605.2045676 hartree
pointgroup: C01 [X(C15H22O3S2)]
dipole: -0.952484 0.341064 -1.681147 debye
polarizability: 247.2097603|4.8000079|231.0034626|-13.6014154|-15.5284148|166.7331747 unknown
InChI: InChI=1S/C15H22O3S2/c1-19-15-11-7-6-9-13(15)12-8-4-3-5-10-14(12)18-20(2,16)17/h6-7,9,11-12,14H,3-5,8,10H2,1-2H3
charge 0 multiplicity 1
42 atoms
S  3.173948 1.348052 0.317414
S  -3.122837 -1.178378 1.590324
O  1.748819 0.373047 -0.410885
O  4.534599 0.472383 0.268419
O  2.695697 2.032202 1.708615
C  -0.398892 -0.758024 -0.125691
C  0.90047 -0.300854 0.616513
C  -0.195123 -1.374073 -1.544167
C  1.641624 -1.438814 1.352895
C  1.014772 -2.325273 -1.743652
C  2.307588 -2.529838 0.486399
C  1.386515 -3.232327 -0.542154
C  -1.443406 0.359482 -0.170457
C  -2.681587 0.282855 0.53099
C  -1.188266 1.534708 -0.929838
C  -3.613685 1.347794 0.47552
C  -2.115101 2.595403 -0.988707
C  -3.337005 2.505371 -0.283165
C  3.206356 2.637952 -1.074778
C  -3.911535 -2.290841 0.275077
H  -0.803886 -1.549996 0.534549
H  0.618966 0.465679 1.367299
H  -0.117459 -0.558125 -2.28629
H  -1.133494 -1.9143 -1.784857
H  0.898022 -1.90191 2.033641
H  2.412869 -0.985053 2.007713
H  1.906316 -1.719948 -1.995776
H  0.798635 -2.954881 -2.629669
H  2.729879 -3.28678 1.177182
H  3.167884 -2.088213 -0.052958
H  0.471789 -3.616983 -0.044021
H  1.923697 -4.121634 -0.927002
H  -0.237015 1.606842 -1.469027
H  -4.54995 1.261481 1.036632
H  -1.887836 3.489553 -1.580498
H  -4.063346 3.324641 -0.318315
H  3.324044 2.072268 -2.0082
H  2.246508 3.166604 -1.016904
H  4.06573 3.289467 -0.864216
H  -3.169842 -2.557159 -0.49362
H  -4.76841 -1.773794 -0.182382
H  -4.252452 -3.197083 0.800248
