program: Gaussian 09
title: 000284273
version: EM64L-G09RevD.01
frameworkgroup: C1[X(C8H7ClFNO3S)]
method: RPBEPBE
basis: SDD
operation: Freq
keyword: #p
keyword: freq=noraman
keyword: PBEPBE/SDD
title: #p freq=noraman PBEPBE/SDD
converged: YES YES NO NO
title: Mulliken charges:
elementType: Cl S F O O O N C C C C C C C C H H H H H H H
charge: -0.029890 1.076344 -0.334921 -0.463370 -0.491236 -0.240033 -0.463558 -0.347547 0.571251 -0.214844 -0.302001 -0.233536 -0.210274 0.272610 -0.686902 0.290559 0.324041 0.381985 0.253454 0.245791 0.302185 0.299892
chargesum: 0.00000
title: Mulliken charges with hydrogens summed into heavy atoms:
elementType: Cl S F O O O N C C C C C C C C
charge: -0.029890 1.076344 -0.334921 -0.463370 -0.491236 -0.240033 -0.081573 -0.347547 0.571251 0.075715 0.022039 0.019918 0.035517 0.272610 -0.084825
polarizability: 1.84338744e+02 -2.45371674e+00 1.68567629e+02 6.27497895e+00 5.61034587e+00 7.12292307e+01
1716.lowfreq: -11.0674 -6.2084 0.0019 0.0022 0.0030 0.7741 14.6399 23.5853 69.6863
frequency: 14.5090 23.3553 69.6839 86.0773 96.7943 100.8639 157.5747 184.2546 198.7252 221.0290 259.4686 281.1264 287.6096 326.0878 384.7554 400.8664 443.4643 449.2281 480.0821 522.3658 556.1391 574.8747 627.1509 672.0343 710.4641 715.8451 773.1572 835.8569 838.5705 861.0838 889.6203 912.7111 938.1279 969.9175 975.4220 985.2504 1011.0815 1045.7161 1128.7978 1162.0936 1178.0367 1220.6272 1248.0084 1267.7119 1307.8846 1365.1233 1419.1800 1426.8256 1464.0100 1531.4292 1571.1118 1601.0580 1618.0461 3064.2112 3146.6418 3149.9214 3156.8386 3179.9371 3193.1127 3253.2445
redmass: 7.2251 13.7065 3.6490 8.1123 6.9894 8.0137 13.2670 6.4002 9.5271 9.2787 10.5985 6.8162 14.2014 7.7112 11.8128 8.7630 6.8037 5.2998 6.8542 3.5696 13.9260 3.2521 6.2484 6.9094 5.8288 4.4959 1.2281 7.1693 4.5802 1.3930 1.3428 1.7028 6.1876 1.4035 6.8984 11.1989 1.3456 2.0934 1.7046 1.1212 1.0680 3.9343 1.5622 1.1988 2.0461 4.9102 1.1437 2.3192 2.5897 2.5401 4.2560 5.4863 4.0217 1.0576 1.1076 1.0875 1.0920 1.0979 1.0958 1.0811
irintensity: 0.3251 0.5227 14.1978 2.1678 0.3944 0.6191 14.1117 2.0957 0.5541 0.5652 9.8642 0.4511 4.6080 4.3168 7.6525 11.7490 20.3810 45.6431 18.7664 19.3006 128.9875 2.0266 5.1625 13.0066 39.2202 20.9048 81.6626 49.6421 16.0723 70.4326 6.4321 28.7135 11.7379 6.3690 22.1260 75.3599 3.7251 6.6270 7.2005 3.7194 4.4102 34.9267 2.0181 17.8513 135.6515 136.6317 22.6816 5.6582 53.0434 377.3632 275.3235 83.7220 73.9528 2.7838 0.3634 8.5952 1.4181 8.0428 12.7428 141.7247
temp: 298.150 k
press: 1.00000 atm
elementType: 17 16 9 8 8 8 7 6 6 6 6 6 6 6 6 1 1 1 1 1 1 1
symmnumber: 1
zpe: 374041.1 jmol-1
zpe.correction: 0.142465 hartree
zpe.thermalcorrener: 0.157421 hartree
zpe.thermalcorrenthalpy: 0.158365 hartree
zpe.thermalcorrgfe: 0.097487 hartree
zpe.sumelectzpe: -1546.179208 hartree
zpe.sumelectthermal: -1546.164252 hartree
zpe.sumelectthermalent: -1546.163308 hartree
zpe.sumelectthermalfe: -1546.224186 hartree
dipole: -1.0101 4.7518 -0.8301
dipole: 4.9284
quadrupole: -89.8950 -110.3502 -105.8590
quadrupole: -11.0708 3.0931 -1.4506
quadrupole: 12.1397 -8.3155 -3.8242 -11.0708 3.0931 -1.4506
hfenergy: -1546.321673 hartree
pointgroup: C01 [X(C8H7Cl1F1N1O3S1)]
dipole: -0.01666 1.9316817 -0.1672219 debye
dipolederiv: -0.2564066 0.0322733 -0.0173902 0.1816718 -0.4884943 -0.0953058 0.0373482 -0.1438804 -0.1684563 1.2959552 0.1568653 -0.0144813 0.3349668 1.8734555 0.0032744 -0.1308885 -0.1527456 1.5692898 -0.3203014 -0.0365049 0.0199617 -0.0823797 -0.5263076 0.0692146 0.1618742 0.3288098 -0.8321135 -0.6000602 -0.1373155 -0.0912239 -0.0782197 -0.5822813 -0.0213175 -0.0614527 -0.0530322 -0.422991 -0.5864427 0.0272623 0.0620332 -0.0753251 -0.6233853 -0.0207977 0.0261865 -0.0269066 -0.4228999 -0.8423418 0.1072767 -0.0401042 -0.4996083 -0.827902 -0.1995627 -0.2249683 -0.0712415 -0.3858175 -2.0056428 0.0753563 -0.2477645 0.1392336 -0.5019855 -0.0235332 -0.3132385 -0.027725 -0.3048097 -0.2792171 0.0518315 0.0118026 -0.1817072 -0.2399717 -0.0296082 -0.050195 -0.1509758 -0.2066275 1.087467 0.0593594 0.1000648 -0.8390903 0.1713021 -0.1092942 -0.0020948 0.0370688 0.139817 -0.127796 -0.3098257 -0.0266199 0.2567607 0.0389849 0.0468675 0.028069 0.0269539 -0.0626642 -0.2746144 -0.003437 -0.0155652 0.4554075 -0.2387303 0.0500296 0.0397847 -0.0057116 -0.1328286 -0.1193748 -0.0928663 -0.0005633 -0.3020099 -0.1904183 -0.0342742 -0.0083121 -0.0088852 -0.1539723 0.285796 0.0726298 0.0512307 -0.0346128 0.2555242 0.0234728 0.0527952 0.0420102 -0.0893528 1.9880322 -0.1855535 0.2259148 0.7374046 0.8123308 0.2463175 0.5008841 0.0541508 0.2878739 -0.0913579 0.204631 0.0191422 -0.0406512 0.5627416 0.1752159 -0.0894159 0.2471485 0.204148 0.0914994 -0.0211907 -0.0101217 -0.0625907 0.1123608 -0.0163844 -0.0244021 -0.0102422 0.1551672 0.1452606 -0.040971 -0.00545 -0.0344167 0.1100774 -0.0058203 0.0085085 -0.0248392 0.1819481 0.3941341 -0.0115013 -0.0179298 0.0853551 0.344164 -0.0027436 0.0654064 0.0155218 0.2655115 -0.0212351 0.0717876 -0.0212121 0.0613647 0.0270976 -0.001319 -0.0274779 -0.015946 0.1691853 0.0991638 -0.0069713 -0.0074408 0.0123523 -0.0767039 -0.0143683 -0.0110249 -0.0113636 0.1477681 0.098743 0.0098819 -0.0201632 0.0214201 0.0045074 -0.0344889 -0.04174 -0.0169048 -0.0167024 0.0387395 -0.0230181 0.0458802 -0.0553255 -0.0163659 -0.0055745 0.064354 -0.0312639 0.0785269 unknown
polarizability: 181.3178169|-6.7136165|168.681967|14.4556061|12.0252786|74.1358199 unknown
InChI: InChI=1S/C8H7ClFNO3S/c9-5-8(12)11-6-3-1-2-4-7(6)15(10,13)14/h1-4,11H,5H2
charge 0 multiplicity 1
22 atoms
Cl 3.215311 -2.269505 -0.289261
S  -1.497929 -1.802164 -0.273348
F  -1.582658 -2.165028 1.544441
O  -2.915339 -2.236065 -0.883832
O  -0.113409 -2.478407 -0.763524
O  2.664249 1.616271 0.736097
N  1.137084 -0.070248 0.093251
C  -1.327185 0.053253 -0.174946
C  -0.060153 0.679194 0.026548
C  -2.546093 0.74869 -0.278319
C  -0.087013 2.102055 0.134238
C  -2.530993 2.152868 -0.181961
C  -1.298184 2.811886 0.033406
C  2.394934 0.417967 0.426829
C  3.556506 -0.577783 0.460931
H  -3.478037 0.196184 -0.436207
H  0.857092 2.621293 0.305807
H  1.083764 -1.075558 -0.163471
H  -3.464177 2.716746 -0.264691
H  -1.274731 3.903087 0.120932
H  3.849218 -0.756494 1.507175
H  4.402244 -0.148842 -0.094593
