program: Gaussian 09
title: 000284302
version: EM64L-G09RevD.01
frameworkgroup: C1[X(C15H20O)]
method: RPBEPBE
basis: SDD
operation: Freq
keyword: #pfreq=noraman
keyword: PBEPBE/SDD
title: #p freq=noraman PBEPBE/SDD
converged: YES YES NO NO
title: Mulliken charges:
elementType: O C C C C C C C C C C C C C C C H H H H H H H H H H H H H H H H H H H H
charge: -0.303997 -0.392461 -0.384033 -0.551907 -0.383533 0.320195 -0.466699 -0.335375 0.209940 0.146258 -0.370053 -0.509750 0.484462 -0.450453 -0.813131 -0.521077 0.197041 0.200424 0.185571 0.201392 0.212725 0.195748 0.198890 0.201132 0.200774 0.201174 0.261740 0.231007 0.250923 0.228088 0.235325 0.222643 0.225568 0.216065 0.229612 0.225770
chargesum: 0.00000
title: Mulliken charges with hydrogens summed into heavy atoms:
elementType: O C C C C C C C C C C C C C C C
charge: -0.303997 0.005005 0.002930 -0.143433 0.016489 0.320195 -0.064751 -0.073634 0.209940 0.146258 -0.139047 -0.258827 0.484462 -0.222365 -0.129595 0.150371
polarizability: 2.34251869e+02 1.03840048e+01 1.57332776e+02 -8.04819977e+00 -1.77302663e+00 1.13097833e+02
1716.lowfreq: -18.1071 -1.6111 -0.0004 0.0004 0.0006 6.6770 43.3005 45.9107 51.4488
frequency: 43.2279 45.1399 51.4153 76.5533 91.4663 132.9203 141.0871 149.9698 189.3535 194.6617 236.6682 277.0097 299.2356 314.0148 320.9918 339.5256 373.1946 419.7652 464.6697 475.6022 481.4408 554.1721 562.9764 592.5688 616.1008 696.0846 705.2922 752.1383 765.9488 812.8337 822.9052 848.4073 865.5428 878.5460 891.8931 896.7584 920.5620 953.3313 961.0204 969.0091 978.3737 1006.8954 1039.7450 1045.9091 1069.9230 1081.0232 1104.7900 1109.1791 1125.7630 1143.7838 1154.1322 1158.3791 1195.5774 1213.1768 1226.7996 1254.4537 1259.9859 1273.4830 1280.8402 1308.8498 1321.4217 1331.9187 1342.7328 1354.6410 1358.3765 1371.6573 1394.9771 1397.3006 1434.3255 1454.4263 1456.9543 1461.1228 1462.1769 1464.5686 1470.0256 1471.0309 1473.1374 1476.1199 1490.1909 1559.8856 1617.1213 1649.5724 2942.8256 2952.9489 2954.5737 2955.2595 2965.1955 2966.5188 2973.9580 3011.1298 3020.4227 3030.2420 3033.2820 3044.3964 3044.7319 3053.9261 3082.9886 3109.4473 3119.9888 3132.6882 3137.9137 3145.7495
redmass: 2.8752 2.6670 1.2385 2.6276 3.0543 2.3537 1.9242 1.6029 2.4800 2.9624 3.6078 3.6014 3.1596 2.8068 2.4658 2.3344 3.9806 3.1220 3.3645 1.8253 3.3305 3.3036 3.9340 3.8213 3.5011 2.3160 6.1372 3.4491 2.8139 1.3710 1.4512 1.6078 1.7830 3.8336 2.1603 1.5727 2.8396 1.3847 2.2113 2.0106 2.3923 1.9084 2.1718 1.5504 2.0647 2.0080 1.8116 1.4245 1.8377 1.5006 1.4458 1.5532 1.1728 1.3253 1.7659 2.2726 1.1861 1.4891 1.5960 1.3685 1.3243 1.5435 2.1796 1.4918 1.4709 2.0327 2.0318 1.4404 1.2741 1.0833 1.0596 1.0919 1.0850 1.0959 1.0676 1.0763 1.0835 1.0940 3.0045 5.4517 6.8007 7.1190 1.0667 1.0604 1.0666 1.0320 1.0599 1.0632 1.0381 1.0966 1.1023 1.1011 1.0940 1.1033 1.0934 1.0958 1.0995 1.1006 1.0869 1.0912 1.0916 1.0959
irintensity: 0.8960 0.5529 0.2011 3.5164 2.3710 0.2503 2.1770 1.0716 1.5334 0.2521 0.6101 2.9655 1.3566 0.5615 2.3590 1.0753 2.9458 2.6499 5.5768 2.0845 5.4272 2.5998 2.2639 5.1206 3.3645 0.1620 2.8550 4.6829 0.3968 20.4724 28.6951 11.4068 7.6793 0.9975 3.3629 13.9669 0.3276 0.8402 14.7956 14.2011 27.4912 18.0154 2.3955 18.2495 1.9836 0.0434 38.6835 5.4897 1.0826 6.1180 14.1873 2.1881 0.5207 2.5655 12.8860 9.0241 3.5850 13.4584 2.0815 2.2270 0.8579 7.2330 14.9451 1.6224 1.1361 5.0343 11.6833 5.1766 1.6162 7.2778 13.0991 1.6858 3.7319 14.5394 9.2432 14.6118 14.8655 19.4591 44.5086 8.2644 17.1468 4.4569 46.4877 28.1363 22.0145 56.8351 39.7409 45.7162 44.4747 87.1673 26.7422 120.9943 60.9118 27.7777 29.7046 23.1770 19.8850 26.9050 16.0402 8.5218 17.4366 15.9651
temp: 298.150 k
press: 1.00000 atm
elementType: 8 6 6 6 6 6 6 6 6 6 6 6 6 6 6 6 1 1 1 1 1 1 1 1 1 1 1 1 1 1 1 1 1 1 1 1
symmnumber: 1
zpe: 811707.7 jmol-1
zpe.correction: 0.309163 hartree
zpe.thermalcorrener: 0.325372 hartree
zpe.thermalcorrenthalpy: 0.326317 hartree
zpe.thermalcorrgfe: 0.265127 hartree
zpe.sumelectzpe: -657.581100 hartree
zpe.sumelectthermal: -657.564891 hartree
zpe.sumelectthermalent: -657.563947 hartree
zpe.sumelectthermalfe: -657.625137 hartree
dipole: 0.6177 -0.6015 1.4523
dipole: 1.6890
quadrupole: -86.7011 -93.1744 -98.5485
quadrupole: 1.3907 -1.1575 3.2068
quadrupole: 6.1069 -0.3664 -5.7405 1.3907 -1.1575 3.2068
hfenergy: -657.8902636 hartree
pointgroup: C01 [X(C15H20O1)]
dipole: 0.2464814 -0.0946356 -0.6097809 debye
polarizability: 234.1489122|-4.2929091|143.7421522|12.8971126|-20.4577451|126.7914144 unknown
InChI: InChI=1S/C15H20O/c1-12-9-10-14(15(11-12)16-2)13-7-5-3-4-6-8-13/h7,9-11H,3-6,8H2,1-2H3
charge 0 multiplicity 1
36 atoms
O  -0.709094 -1.794602 1.307901
C  2.706117 0.252403 -1.557186
C  4.025912 0.176203 -0.752583
C  1.617859 1.181414 -0.944999
C  3.911107 -0.431615 0.664943
C  0.861953 0.571865 0.241307
C  3.005972 0.381213 1.634358
C  1.514762 0.221518 1.391741
C  -0.621818 0.405908 0.120213
C  -1.350596 -0.710589 0.642405
C  -1.401922 1.417651 -0.507854
C  -2.756413 -0.780655 0.559129
C  -3.516297 0.250073 -0.046152
C  -2.80836 1.349931 -0.590574
C  -5.032495 0.179409 -0.092202
C  0.001709 -2.724094 0.412784
H  2.285041 -0.765239 -1.687416
H  2.946875 0.625544 -2.573337
H  4.44512 1.201381 -0.66553
H  4.763437 -0.41223 -1.335444
H  0.901645 1.441716 -1.744677
H  2.109552 2.129624 -0.637858
H  4.928608 -0.49344 1.1013
H  3.529583 -1.470412 0.598881
H  3.295114 1.452518 1.556089
H  3.229698 0.07603 2.673422
H  0.924527 -0.216512 2.205401
H  -0.894234 2.301151 -0.911138
H  -3.247519 -1.663564 0.984512
H  -3.361015 2.164851 -1.073125
H  -5.473519 0.445488 0.888167
H  -5.446526 0.876479 -0.841397
H  -5.384497 -0.838239 -0.340712
H  -0.704672 -3.186591 -0.304736
H  0.431961 -3.498783 1.066725
H  0.810724 -2.208709 -0.13946
