program: Gaussian 09
title: 000284270
version: EM64L-G09RevD.01
frameworkgroup: C1[X(C14H12N4)]
method: RPBEPBE
basis: SDD
operation: Freq
keyword: #pfreq=noraman
keyword: PBEPBE/SDD
title: #p freq=noraman PBEPBE/SDD
converged: YES YES NO NO
title: Mulliken charges:
elementType: N N N N C C C C C C C C C C C C C C H H H H H H H H H H H H
charge: -0.398354 0.017610 -0.160400 -0.057971 0.449632 0.472196 -0.398350 -0.340929 -0.411497 -0.366243 -0.805430 0.056354 0.283066 -0.340138 -0.346036 -0.206318 -0.236780 -0.189897 0.231842 0.238380 0.222162 0.311043 0.233145 0.222467 0.233349 0.302697 0.253959 0.256651 0.235475 0.238317
chargesum: 0.00000
title: Mulliken charges with hydrogens summed into heavy atoms:
elementType: N N N N C C C C C C C C C C C C C C
charge: -0.095657 0.017610 -0.160400 -0.057971 0.449632 0.472196 -0.166508 -0.102550 -0.189335 -0.055200 -0.116469 0.056354 0.283066 -0.086179 -0.089386 0.029157 0.001537 -0.189897
polarizability: 4.18879872e+02 -6.15122786e+00 1.85703045e+02 4.17987476e-01 1.50769710e-01 7.29786537e+01
1716.lowfreq: -8.9564 -0.0011 -0.0009 -0.0007 3.0830 4.3430 25.8924 50.4479 52.3169
frequency: 25.7894 50.4299 52.2051 54.3387 88.9677 139.3152 141.6834 175.0235 192.0951 194.2949 232.7712 295.7628 319.7761 347.0373 390.5088 393.6506 408.3438 429.9088 510.1381 516.0984 519.2449 548.3216 575.5960 604.4460 629.8295 654.0646 708.4402 717.1209 734.7234 759.9261 771.0758 775.0146 818.0373 830.6001 857.6017 892.0220 919.6422 945.1272 966.7188 988.1355 995.2834 996.9127 1004.7072 1035.6782 1047.4750 1103.3046 1126.6477 1170.9191 1172.1845 1187.4340 1190.8684 1223.2173 1224.3611 1264.7729 1278.3636 1316.4647 1337.8151 1373.8722 1381.4578 1398.6206 1420.0157 1428.3647 1462.2421 1469.7364 1472.7048 1490.8814 1515.7853 1558.1254 1593.0773 1604.6534 1622.7382 2159.4753 2975.2285 3052.9022 3082.8350 3116.1561 3130.5918 3139.3380 3142.8992 3150.0686 3164.4959 3165.4082 3176.6813 3371.3760
redmass: 5.4789 3.0209 1.1687 5.7412 4.2762 5.2555 6.8146 3.6075 6.1011 7.2150 6.1749 6.0689 3.1889 4.3773 5.9579 4.2025 2.9197 6.4684 6.7411 3.1678 3.0647 8.2822 4.2921 6.3364 6.9086 6.7046 6.0155 2.7514 1.3964 3.3916 4.8083 1.3193 1.4275 5.9737 1.2830 1.4595 4.9729 1.3492 1.3819 1.4156 1.3410 1.3232 2.8126 2.3139 1.5463 2.1135 1.4391 1.0972 3.3888 2.5479 1.1580 2.3936 3.8650 2.1324 1.7386 1.3667 6.6219 6.4965 8.3112 1.2472 3.3352 2.3220 2.2984 1.0457 1.2555 1.6766 2.8582 6.2070 5.4548 6.2777 6.2608 12.6316 1.0372 1.0975 1.0988 1.0877 1.0902 1.0857 1.0963 1.0905 1.0949 1.0965 1.1007 1.0742
irintensity: 1.5833 0.6424 0.1189 1.0613 0.1410 0.2479 2.3183 9.2097 0.3556 10.4336 1.0691 3.2353 0.8155 0.0574 2.4846 0.1199 0.1141 5.4999 2.8774 29.3418 5.0131 1.2148 2.2209 8.8296 8.9694 16.2176 1.1628 1.5687 75.9681 11.3737 1.6828 73.0357 68.6916 0.6073 15.5553 0.3607 0.1826 3.3981 4.2493 4.8588 0.2919 2.9862 1.3197 10.8631 11.4633 5.7658 14.5755 6.1482 82.9132 1.9255 0.3899 6.6371 4.3903 150.3965 62.7803 8.0100 322.2402 0.6486 249.6589 3.7289 10.2176 52.1650 103.8441 12.9717 10.8076 3.2135 207.2649 9.3334 12.7322 11.5698 0.4485 22.8426 48.2822 20.4757 21.9859 15.8406 15.9709 2.3270 26.0916 6.3911 13.4569 9.3221 25.7213 17.9960
temp: 298.150 k
press: 1.00000 atm
elementType: 7 7 7 7 6 6 6 6 6 6 6 6 6 6 6 6 6 6 1 1 1 1 1 1 1 1 1 1 1 1
symmnumber: 1
zpe: 600943.9 jmol-1
zpe.correction: 0.228887 hartree
zpe.thermalcorrener: 0.244732 hartree
zpe.thermalcorrenthalpy: 0.245677 hartree
zpe.thermalcorrgfe: 0.184095 hartree
zpe.sumelectzpe: -758.396471 hartree
zpe.sumelectthermal: -758.380626 hartree
zpe.sumelectthermalent: -758.379681 hartree
zpe.sumelectthermalfe: -758.441263 hartree
dipole: 0.0856 -2.9470 0.0316
dipole: 2.9484
quadrupole: -71.2195 -100.1156 -110.1978
quadrupole: 1.7535 0.0564 0.1958
quadrupole: 22.6248 -6.2713 -16.3535 1.7535 0.0564 0.1958
hfenergy: -758.6253582 hartree
pointgroup: C01 [X(C14H12N4)]
dipole: 0.0298354 0.4263771 1.0783934 debye
polarizability: 415.7465467|-29.7449418|91.940176|-8.3286433|40.5216945|169.8748482 unknown
InChI: InChI=1S/C14H12N4/c1-11-6-8-13(9-7-11)16-18-17-14-5-3-2-4-12(14)10-15/h2-9,16H,1H3
charge 0 multiplicity 1
30 atoms
N  0.995788 0.715388 1.146193
N  -0.167236 0.526018 0.486303
N  -1.211281 0.901051 1.19735
N  -0.805902 -0.607541 -2.469258
C  4.781685 -0.289149 -0.541247
C  2.239674 0.374181 0.561867
C  4.675148 0.272281 0.755853
C  3.580108 -0.507487 -1.270264
C  3.420865 0.603417 1.310113
C  2.31724 -0.185755 -0.741195
C  6.130251 -0.648704 -1.13867
C  -2.455441 0.721443 0.533189
C  -2.669051 0.203164 -0.794187
C  -3.587037 1.112349 1.300054
C  -3.998141 0.09998 -1.294243
C  -4.892989 1.002415 0.789422
C  -5.103495 0.493739 -0.515622
C  -1.608286 -0.224932 -1.666504
H  5.583204 0.454109 1.342495
H  3.633942 -0.939542 -2.27685
H  3.363029 1.036307 2.316873
H  1.405003 -0.361261 -1.319174
H  6.309343 -0.104402 -2.085095
H  6.957077 -0.405776 -0.449287
H  6.191738 -1.728705 -1.371206
H  0.953464 1.117661 2.097056
H  -3.399801 1.503029 2.305015
H  -4.14738 -0.294774 -2.304634
H  -5.745366 1.311304 1.403618
H  -6.116453 0.405391 -0.920759
