program: Gaussian 09
title: 000284312
version: EM64L-G09RevD.01
frameworkgroup: C1[X(C15H22O4S)]
method: RPBEPBE
basis: SDD
operation: Freq
keyword: #p
keyword: freq=noraman
keyword: PBEPBE/SDD
title: #p freq=noraman PBEPBE/SDD
converged: NO YES NO NO
title: Mulliken charges:
elementType: S O O O O C C C C C C C C C C C C C C C H H H H H H H H H H H H H H H H H H H H H H
charge: 1.051318 -0.423138 -0.508165 -0.531301 -0.267092 -0.227366 -0.120999 -0.423979 -0.385122 -0.416266 -0.370034 -0.398375 0.499141 -0.452523 -0.358883 -0.369049 -0.379048 0.309711 -0.734503 -0.538254 0.213898 0.291796 0.216043 0.193556 0.188257 0.231179 0.195911 0.202025 0.196668 0.204990 0.191599 0.202416 0.239140 0.224879 0.251409 0.239472 0.280553 0.283681 0.307378 0.221938 0.221711 0.245426
chargesum: 0.00000
title: Mulliken charges with hydrogens summed into heavy atoms:
elementType: S O O O O C C C C C C C C C C C C C C C
charge: 1.051318 -0.423138 -0.508165 -0.531301 -0.267092 -0.013468 0.170797 -0.014380 0.034315 -0.018330 0.031624 -0.004360 0.499141 -0.213383 -0.134003 -0.117640 -0.139575 0.309711 0.137109 0.150820
polarizability: 2.49115508e+02 1.05165633e+01 1.88689209e+02 -2.50582146e+00 6.12208036e+00 1.66594997e+02
1716.lowfreq: -7.7974 -4.8122 0.0011 0.0015 0.0024 9.9615 15.3670 29.1325 34.2708
frequency: 14.7658 28.9093 34.2331 45.1936 51.3904 77.0751 101.8391 132.4709 147.7168 159.0700 165.0030 184.2050 200.3073 212.0635 229.6721 237.9452 253.6293 258.3742 304.9486 312.2895 327.0793 347.2284 355.3045 385.0375 412.3038 414.9785 438.8970 468.4886 486.4201 508.2777 541.4843 552.3066 583.5540 599.4180 633.1913 732.1212 733.5321 772.8663 782.8774 814.0226 815.3716 820.2530 830.0492 835.6465 869.5955 876.0570 902.2140 915.4546 941.1325 954.2017 962.2690 974.0596 988.1095 995.6623 1003.3575 1025.1627 1040.1026 1053.0241 1074.3743 1108.3751 1114.1401 1124.0249 1136.0038 1155.6480 1162.1849 1177.8755 1181.4550 1213.3612 1221.1743 1229.9160 1246.8556 1260.7143 1280.2287 1290.2333 1309.3659 1319.7417 1322.2936 1327.0149 1339.9878 1344.3949 1353.7494 1358.6303 1368.0615 1387.4191 1414.8041 1416.7856 1419.0131 1437.4069 1450.7068 1461.9402 1465.5476 1466.8839 1473.0447 1475.2943 1477.6011 1500.1223 1582.4312 1620.3756 2956.3435 2958.8122 2960.9415 2964.7271 2972.6801 2979.6444 2983.6477 2994.2028 3014.3409 3023.1306 3033.2996 3035.2399 3037.7083 3042.4679 3046.4438 3121.7259 3124.6992 3126.2715 3159.7096 3163.3394 3183.4784 3188.8920
redmass: 5.0378 5.5001 4.5663 3.2790 4.4079 3.5967 3.8901 6.2272 3.8777 3.3922 2.1366 1.3235 2.6541 4.8582 1.8478 2.4366 2.1275 3.4635 3.9720 2.3732 5.6948 7.3311 3.8654 4.1179 3.0112 4.0384 3.5022 1.7982 3.9072 3.3223 2.9049 3.1955 4.2434 6.6703 6.6066 3.7558 3.5553 2.6890 3.3972 1.4567 2.8117 1.7846 1.9215 3.1627 2.1339 2.6513 2.7838 2.9565 1.4050 2.3383 1.3552 1.7745 7.6831 1.3817 2.6054 1.8732 1.9409 2.2864 2.2948 1.3787 1.2592 2.1374 1.7735 1.4095 1.8923 1.1897 1.1994 1.7874 1.3583 3.5470 1.2288 1.3680 1.3109 1.1969 1.3183 1.1349 1.3101 1.2307 1.6388 1.3750 1.4286 1.4593 1.3990 3.4977 1.1546 1.4138 1.4500 1.1737 1.0813 1.0818 1.0883 1.0498 1.0762 1.0822 1.0861 2.4251 6.9398 6.3667 1.0601 1.0331 1.0650 1.0761 1.0650 1.0628 1.0704 1.0823 1.0947 1.0999 1.0247 1.1005 1.0997 1.0992 1.1039 1.0894 1.0985 1.0894 1.0937 1.0953 1.1082 1.1075
irintensity: 0.1325 2.0895 3.2908 1.0144 5.5548 0.5313 1.5176 4.6306 2.6069 0.3710 3.4501 2.1964 0.1364 1.0167 1.4943 2.0663 0.7038 3.2490 13.4920 0.8202 3.7105 17.5061 16.8847 6.5260 2.9256 18.3078 4.3387 3.6215 7.3210 12.3486 12.2734 38.5138 11.5539 59.8171 1.4790 1.5691 11.1289 13.9550 16.0165 19.2839 16.8476 16.4743 79.2899 26.0551 8.7960 1.9777 27.0332 33.1252 0.8557 28.6959 0.3969 24.5647 41.7693 16.3578 7.4384 2.8899 54.5094 9.2409 6.6905 11.6535 0.1820 2.4995 2.2918 0.8556 18.3364 44.5812 19.4215 11.7498 1.3912 175.6535 1.7655 1.4962 2.1981 1.3708 0.2556 1.7811 2.8034 4.8923 4.2839 2.5903 1.4287 1.5027 3.8380 9.4021 6.0161 10.0143 4.1842 9.8833 10.0223 8.5566 6.9089 13.2977 63.7246 7.2876 17.7717 115.8571 5.8365 46.2784 31.6626 67.7303 33.0935 7.8880 10.8349 20.1339 7.3370 34.7768 69.1817 51.7293 1.3497 23.1057 82.2427 39.4446 47.8566 22.5576 21.0415 9.9584 13.7872 3.7565 0.7038 1.6923
temp: 298.150 k
press: 1.00000 atm
elementType: 16 8 8 8 8 6 6 6 6 6 6 6 6 6 6 6 6 6 6 6 1 1 1 1 1 1 1 1 1 1 1 1 1 1 1 1 1 1 1 1 1 1
symmnumber: 1
zpe: 903079.7 jmol-1
zpe.correction: 0.343965 hartree
zpe.thermalcorrener: 0.365348 hartree
zpe.thermalcorrenthalpy: 0.366292 hartree
zpe.thermalcorrgfe: 0.291840 hartree
zpe.sumelectzpe: -1282.016514 hartree
zpe.sumelectthermal: -1281.995131 hartree
zpe.sumelectthermalent: -1281.994187 hartree
zpe.sumelectthermalfe: -1282.068639 hartree
dipole: 2.8418 -2.9225 0.3930
dipole: 4.0953
quadrupole: -118.7459 -137.0766 -124.5707
quadrupole: 15.1861 -6.3709 9.7306
quadrupole: 8.0518 -10.2789 2.2270 15.1861 -6.3709 9.7306
hfenergy: -1282.3604788 hartree
pointgroup: C01 [X(C15H22O4S1)]
dipole: 1.4600063 -0.5610984 0.3866699 debye
polarizability: 231.4841135|28.8998745|207.6854623|0.3494967|4.181313|165.2301377 unknown
InChI: InChI=1S/C15H22O4S/c1-18-13-10-8-12(9-11-13)14-6-4-3-5-7-15(14)19-20(2,16)17/h8-11,14-15H,3-7H2,1-2H3
charge 0 multiplicity 1
42 atoms
S  -2.047406 2.2929 -0.603252
O  -1.999043 0.641844 0.299828
O  -3.552246 2.881596 -0.584738
O  -1.250982 2.133874 -2.010802
O  4.348176 1.70193 0.700442
C  -0.585016 -1.293308 0.292157
C  -1.622988 -0.513292 -0.571054
C  -0.395566 -2.767877 -0.191409
C  -2.893178 -1.263835 -1.021675
C  -1.403922 -3.7601 0.441554
C  -3.507163 -2.254972 -0.00344
C  -2.864937 -3.663539 -0.058981
C  0.729289 -0.515299 0.36642
C  1.165244 0.062518 1.588115
C  1.546909 -0.333921 -0.776343
C  2.367653 0.791897 1.671186
C  2.758557 0.390471 -0.716595
C  3.170582 0.958198 0.515327
C  -0.97674 3.227182 0.652755
C  5.212158 1.899402 -0.466107
H  -1.002019 -1.341784 1.31788
H  -1.113548 -0.105023 -1.469432
H  0.625187 -3.085388 0.094883
H  -0.43958 -2.828108 -1.298136
H  -2.662197 -1.813057 -1.957223
H  -3.635805 -0.490674 -1.29526
H  -1.383444 -3.61445 1.541877
H  -1.044127 -4.793133 0.26052
H  -4.586267 -2.361868 -0.227625
H  -3.44745 -1.835381 1.020816
H  -2.912277 -4.021223 -1.109275
H  -3.480833 -4.367962 0.535611
H  0.548371 -0.05925 2.486569
H  1.239332 -0.758944 -1.739847
H  2.706711 1.232381 2.614045
H  3.35942 0.510295 -1.623105
H  -0.891437 4.256762 0.277832
H  -1.518636 3.166201 1.605673
H  -0.016842 2.694836 0.683918
H  4.686301 2.452351 -1.268931
H  5.581265 0.933211 -0.862255
H  6.059199 2.496542 -0.097821
