program: Gaussian 09
title: 000284257
version: EM64L-G09RevD.01
frameworkgroup: C1[X(C16H17NO5)]
method: RPBEPBE
basis: SDD
operation: Freq
keyword: #p
keyword: freq=noraman
keyword: PBEPBE/SDD
title: #p freq=noraman PBEPBE/SDD
converged: YES YES NO NO
title: Mulliken charges:
elementType: O O O O O N C C C C C C C C C C C C C C C C H H H H H H H H H H H H H H H H H
charge: -0.223192 -0.165540 -0.409265 -0.246710 -0.253473 -0.152179 -0.476409 -0.394833 0.306339 -0.375587 0.084405 -0.120074 -0.488485 -0.376782 0.460768 0.217710 -0.317270 -0.397855 -0.378203 -0.370895 0.328485 -0.535730 0.236192 0.239591 0.207524 0.291369 0.232767 0.204969 0.255784 0.275259 0.268017 0.240899 0.239658 0.256373 0.248917 0.378305 0.252663 0.228362 0.228125
chargesum: 0.00000
title: Mulliken charges with hydrogens summed into heavy atoms:
elementType: O O O O O N C C C C C C C C C C C C C C C C
charge: -0.223192 -0.165540 -0.030960 -0.246710 -0.253473 -0.152179 -0.000626 0.104061 0.306339 0.062149 0.084405 -0.120074 0.042559 -0.108764 0.460768 0.217710 -0.076371 -0.158198 -0.121830 -0.121978 0.328485 0.173420
polarizability: 3.79325301e+02 4.53189722e+01 1.94719255e+02 -1.80329566e+01 1.53283359e+01 1.16249755e+02
1716.lowfreq: -10.7083 -3.0019 -0.0009 -0.0005 0.0001 1.7644 11.4340 22.6401 29.6784
frequency: 11.2350 22.5178 29.6642 47.3306 53.2044 64.1124 77.4878 84.9737 119.4468 120.0263 163.3673 186.7140 194.8852 201.0278 235.6115 246.9301 263.8371 298.1937 315.4581 328.0338 334.5150 399.9723 411.9769 433.3755 450.6442 458.2494 496.1244 514.9265 529.6782 534.9305 547.3381 580.1827 601.1723 627.0730 634.3426 693.7396 732.5111 736.1238 753.1383 768.9022 775.4758 813.6220 819.8173 831.8679 833.7109 884.2878 924.6058 940.9894 961.4472 974.5792 979.5697 989.4610 992.7284 998.7119 1000.7424 1047.7590 1062.8807 1109.8600 1111.2369 1117.4666 1140.8534 1154.7230 1161.9561 1176.0097 1182.8909 1184.7375 1222.2044 1244.9991 1254.2730 1269.1110 1280.8976 1293.6549 1310.3441 1350.1764 1351.1002 1355.4301 1373.6620 1386.5296 1403.7598 1435.9123 1437.0901 1437.4253 1452.4970 1463.5995 1468.8242 1471.7134 1482.8981 1503.8149 1562.4467 1593.0514 1623.7812 1639.3275 1664.2613 1664.8085 2939.0045 2970.0826 2980.7078 2990.1374 2996.1951 3007.3500 3051.6404 3063.0123 3065.6768 3073.2368 3076.7458 3131.8162 3135.5525 3160.4631 3167.4721 3187.1300 3520.2999
redmass: 5.4697 6.2214 3.9843 6.1187 6.6544 8.2653 5.0915 5.3732 4.4727 5.2951 3.3482 2.7105 4.3314 4.8645 1.3698 2.6497 3.5219 4.8441 3.3690 6.3105 3.9024 3.1709 2.8957 4.9599 3.9109 3.0070 1.9408 4.5789 5.1292 2.1836 3.4075 7.1596 4.1075 6.5665 1.4048 5.4309 5.9131 3.5444 3.9153 3.1580 5.4311 1.2620 5.2437 2.9009 1.7059 2.4733 3.3272 1.3641 1.3857 1.4970 7.9642 2.4890 2.4653 2.3231 1.8381 2.6933 2.6741 2.5421 1.2592 1.5247 2.2781 1.6266 1.5068 1.2328 1.2258 1.2248 1.7964 2.5963 1.8913 1.4597 3.1128 1.6245 1.3538 1.3976 1.5802 2.8691 1.7663 2.2633 2.0204 1.3010 1.2421 2.1566 1.0921 1.0880 1.0501 1.0799 1.1121 2.5094 6.6749 9.4448 6.9199 10.0505 9.6366 8.1026 1.0572 1.0326 1.1033 1.0620 1.0631 1.0636 1.0999 1.1045 1.0975 1.0877 1.0998 1.0897 1.0999 1.0887 1.0944 1.0949 1.0640
irintensity: 0.1742 0.7666 0.2672 0.7846 1.1630 1.0415 0.7067 7.2810 3.3401 5.9196 0.8827 0.9669 2.6045 1.3591 0.0119 3.2535 3.3902 4.3944 4.7197 6.0499 5.0146 3.6205 0.2795 0.5869 6.6251 28.1200 28.2328 12.4365 43.5193 37.6132 2.6416 3.3788 13.7209 2.9623 133.7231 7.3261 3.6253 0.7089 6.9636 15.9411 2.7579 2.3355 5.2366 8.6173 64.2420 9.8807 4.4769 7.6174 0.0771 12.3867 40.5484 43.5385 20.5573 17.8417 18.3718 259.6085 20.8221 24.6576 0.1129 29.6478 16.5905 152.6513 79.2728 73.6394 121.5069 3.1228 32.1587 275.5248 16.2174 11.9963 21.0606 10.3743 18.9808 12.9319 17.2465 5.7326 41.9336 18.5965 0.0638 41.0950 22.0063 26.2924 10.1417 26.5041 16.3499 57.2750 1.1289 153.4709 40.6905 748.0694 115.6055 326.4877 155.8281 175.1208 29.2035 83.4885 21.4350 16.9008 50.0993 16.2442 11.5738 40.0695 21.0816 1.8056 8.3699 11.2635 16.3607 3.6432 17.4486 6.5057 29.7722
temp: 298.150 k
press: 1.00000 atm
elementType: 8 8 8 8 8 7 6 6 6 6 6 6 6 6 6 6 6 6 6 6 6 6 1 1 1 1 1 1 1 1 1 1 1 1 1 1 1 1 1
symmnumber: 1
zpe: 795451.3 jmol-1
zpe.correction: 0.302971 hartree
zpe.thermalcorrener: 0.324098 hartree
zpe.thermalcorrenthalpy: 0.325042 hartree
zpe.thermalcorrgfe: 0.249331 hartree
zpe.sumelectzpe: -1049.156405 hartree
zpe.sumelectthermal: -1049.135278 hartree
zpe.sumelectthermalent: -1049.134334 hartree
zpe.sumelectthermalfe: -1049.210045 hartree
dipole: -8.8223 -5.0864 1.2083
dipole: 10.2550
quadrupole: -99.6806 -140.6843 -130.5242
quadrupole: -15.6505 2.8151 0.6410
quadrupole: 23.9491 -17.0546 -6.8945 -15.6505 2.8151 0.6410
hfenergy: -1049.459376 hartree
pointgroup: C01 [X(C16H17N1O5)]
dipole: 3.4341686 2.0360643 -0.5824085 debye
polarizability: 376.7651018|55.2188716|160.593283|-1.5587764|-40.684996|152.9359262 unknown
InChI: InChI=1S/C16H17NO5/c1-22-13-6-4-11(5-7-13)9-12-10-17(16(21)15(12)20)8-2-3-14(18)19/h4-7,9,18H,2-3,8,10H2,1H3
charge 0 multiplicity 1
39 atoms
O  -3.492534 -1.659446 0.445806
O  -0.965706 -2.506561 1.913751
O  -6.280606 0.928917 1.114367
O  -6.066363 0.728714 -1.18738
O  6.24966 1.644233 -0.474855
N  -1.943978 -0.236341 -0.640975
C  -0.503517 0.09595 -0.624445
C  -2.882377 0.388834 -1.582832
C  0.070133 -0.813086 0.449456
C  -3.373739 1.787824 -1.130333
C  -2.324034 -1.218328 0.272817
C  -1.033664 -1.633305 1.008083
C  -4.236986 1.742278 0.145442
C  1.357845 -0.945705 0.911476
C  2.589183 -0.264748 0.529599
C  -5.58509 1.083037 -0.088018
C  2.688516 0.738493 -0.489345
C  3.788469 -0.617998 1.217684
C  3.912193 1.345914 -0.793317
C  5.02576 -0.017207 0.924986
C  5.089957 0.974174 -0.089019
C  7.503462 1.305804 0.211917
H  -0.350015 1.169966 -0.389617
H  -0.056189 -0.098182 -1.62233
H  -2.388155 0.469254 -2.570488
H  -3.748263 -0.288061 -1.686014
H  -3.964266 2.220408 -1.959246
H  -2.507137 2.455908 -0.96075
H  -4.427606 2.763358 0.529207
H  -3.731002 1.198207 0.963229
H  1.461539 -1.6998 1.708814
H  1.804291 1.046218 -1.051989
H  3.740543 -1.383705 2.001276
H  3.992593 2.111196 -1.571108
H  5.918856 -0.319824 1.478941
H  -7.139102 0.456004 0.940539
H  8.264249 1.948647 -0.252905
H  7.766693 0.242021 0.059117
H  7.436488 1.525738 1.294261
