program: Gaussian 09
title: 000284260
version: EM64L-G09RevD.01
frameworkgroup: C1[X(C16H16N4O3)]
method: RPBEPBE
basis: SDD
operation: Freq
keyword: #p
keyword: freq=noraman
keyword: PBEPBE/SDD
title: #p freq=noraman PBEPBE/SDD
converged: YES YES NO NO
title: Mulliken charges:
elementType: O O O N N N N C C C C C C C C C C C C C C C C H H H H H H H H H H H H H H H H
charge: -0.226750 -0.410188 -0.246812 -0.162252 0.005985 -0.120711 -0.582430 -0.487065 0.205638 -0.390911 -0.142015 0.111127 -0.374021 0.102783 -0.490418 0.314927 -0.086754 -0.357772 -0.349458 0.217388 -0.234971 -0.258091 -0.233391 0.250973 0.237680 0.206076 0.289243 0.231309 0.205373 0.255819 0.276874 0.280617 0.224769 0.230604 0.228694 0.328885 0.338900 0.232979 0.377368
chargesum: 0.00000
title: Mulliken charges with hydrogens summed into heavy atoms:
elementType: O O O N N N N C C C C C C C C C C C C C C C C
charge: -0.226750 -0.032820 -0.246812 -0.162252 0.005985 -0.120711 0.085355 0.001588 0.205638 0.104407 -0.142015 0.111127 0.062661 0.102783 0.042275 0.314927 -0.086754 -0.077155 -0.124689 0.217388 -0.004367 -0.029397 -0.000412
polarizability: 2.81849288e+02 2.61118237e+01 2.52540331e+02 -2.82927705e+01 1.47158970e+01 1.20186198e+02
1716.lowfreq: -9.4716 -6.5512 0.0004 0.0007 0.0008 4.0006 9.4454 16.0791 25.4724
frequency: 9.3415 15.8003 25.1651 46.4965 59.1063 69.6253 83.5762 111.0075 133.2890 160.6617 183.2358 219.0326 237.2590 248.6855 271.0111 283.1546 303.0168 309.9152 327.0993 393.8835 402.4379 406.1676 448.8089 456.2380 483.9123 488.6070 501.8613 537.1677 550.8949 563.1745 598.0926 613.4786 619.4197 631.6101 636.9758 672.2449 693.9710 698.5648 750.0703 757.3541 780.1527 788.9624 800.0915 807.0249 843.7932 851.3072 884.6303 895.6158 933.7704 973.4979 984.0882 988.4872 990.3247 994.7573 1007.8458 1014.2174 1028.6155 1047.0256 1047.7119 1087.1030 1097.2600 1119.2792 1140.0018 1163.7967 1173.4725 1177.6471 1190.8014 1201.2661 1232.1034 1253.6166 1267.9790 1287.1124 1295.2075 1305.8795 1337.5079 1351.7953 1353.7111 1358.4196 1373.5718 1385.8794 1388.4853 1434.1539 1437.4663 1453.4997 1467.5174 1471.8117 1477.4865 1486.8851 1527.7122 1563.9476 1589.1009 1607.9157 1614.2272 1646.9909 1664.4261 2943.3172 2986.9301 2991.1667 2997.2413 3007.6701 3052.0779 3065.4461 3077.2694 3128.7859 3140.3354 3158.2066 3173.0887 3185.3734 3518.7104 3559.0724 3718.1300
redmass: 4.4984 5.3431 5.9722 5.9368 8.2819 5.3315 6.2968 4.9766 4.4240 5.6995 3.9446 4.3938 5.4598 3.0290 4.4499 7.6145 3.6305 3.4859 2.7269 3.4763 2.9383 3.8461 3.8173 3.3698 1.3292 1.9574 2.7371 1.5089 2.1904 3.8200 4.9661 4.9822 6.3074 1.4426 6.3735 5.5198 3.4663 1.9043 7.9041 2.9730 2.9387 5.2554 4.2193 5.4565 2.9896 1.2579 2.5665 4.5798 1.4389 2.9661 1.5543 1.7379 4.4225 2.1325 1.3696 2.4172 2.2184 2.6297 2.7940 1.6031 2.3264 3.4362 2.1508 1.1735 1.0591 1.1598 1.1394 1.6769 4.5218 1.8992 1.5227 3.0996 1.9893 1.7365 3.4642 1.6124 1.4223 3.5798 1.6717 3.1737 3.7982 1.0893 2.3535 1.0948 1.0864 1.1472 2.6120 2.7858 8.6314 6.2058 6.0941 1.8060 4.4149 10.6455 8.0549 1.0584 1.1012 1.0626 1.0633 1.0634 1.1000 1.0978 1.0996 1.0853 1.0901 1.0955 1.0956 1.0937 1.0640 1.0442 1.1059
irintensity: 0.0565 0.1205 0.3391 1.5539 1.6395 0.5861 2.6965 6.2780 2.1196 0.4904 1.9895 6.5963 1.6549 5.4409 0.5760 1.4466 1.2060 0.7135 8.3425 11.7959 1.2043 2.0821 5.7527 15.8622 283.4919 24.8685 38.5541 1.7569 6.0582 3.8305 8.7944 2.3322 0.6743 120.5456 24.4329 3.9575 12.6334 56.4445 28.0842 25.0084 39.5800 3.3442 1.0883 1.9471 11.1853 1.9497 15.5906 1.3142 2.1735 2.9702 1.1222 0.4477 0.6564 4.3682 1.9055 3.8627 12.2469 54.6788 195.0840 13.4472 11.8679 5.2216 38.9438 10.2551 1.4317 5.2027 15.2851 17.0945 43.6690 23.5031 9.7487 0.8953 40.5157 1.6998 33.7643 20.9278 15.8614 43.2011 30.8613 15.3729 30.4264 28.5999 2.9346 11.8152 25.0534 13.1929 104.1707 73.3908 280.7446 182.9177 3.9573 482.2173 106.2729 292.3237 189.8671 38.8102 14.7256 18.4136 51.6372 17.6466 11.6273 22.8359 7.9605 0.2565 14.1375 29.1691 19.4913 11.2655 27.0550 136.6294 47.3877
temp: 298.150 k
press: 1.00000 atm
elementType: 8 8 8 7 7 7 7 6 6 6 6 6 6 6 6 6 6 6 6 6 6 6 6 1 1 1 1 1 1 1 1 1 1 1 1 1 1 1 1
symmnumber: 1
zpe: 791635.9 jmol-1
zpe.correction: 0.301518 hartree
zpe.thermalcorrener: 0.321876 hartree
zpe.thermalcorrenthalpy: 0.322820 hartree
zpe.thermalcorrgfe: 0.248728 hartree
zpe.sumelectzpe: -1062.376467 hartree
zpe.sumelectthermal: -1062.356110 hartree
zpe.sumelectthermalent: -1062.355166 hartree
zpe.sumelectthermalfe: -1062.429257 hartree
dipole: -4.5823 -2.8680 1.5992
dipole: 5.6374
quadrupole: -131.8962 -113.7644 -136.6218
quadrupole: -6.0794 4.8881 4.7203
quadrupole: -4.4687 13.6631 -9.1943 -6.0794 4.8881 4.7203
hfenergy: -1062.6779855 hartree
pointgroup: C01 [X(C16H16N4O3)]
dipole: -1.7901656 1.2500104 -0.3897857 debye
polarizability: 280.073373|-34.2054448|236.5044945|26.2703182|44.2657054|137.9979494 unknown
InChI: InChI=1S/C16H16N4O3/c17-16-18-13(10-5-2-1-3-6-10)11-9-20(8-4-7-12(21)22)15(23)14(11)19-16/h1-3,5-6,21H,4,7-9,17H2
charge 0 multiplicity 1
39 atoms
O  2.723036 -1.630081 0.443244
O  5.7386 -0.000512 -1.379864
O  5.754903 0.776958 0.805981
N  1.502603 0.348943 0.910627
N  -0.056698 -2.589887 -0.485005
N  -2.345035 -1.721005 -0.711261
N  -1.788315 -3.902723 -1.358175
C  0.117242 0.85613 0.83881
C  -0.645574 -0.312889 0.24359
C  2.61105 1.136894 1.464627
C  0.259322 -1.387219 0.040806
C  1.646485 -0.974016 0.469206
C  3.224672 2.135616 0.450663
C  -1.993029 -0.506276 -0.169275
C  3.925326 1.439234 -0.73215
C  -3.079813 0.512439 -0.09808
C  -1.390627 -2.697645 -0.833304
C  -4.284512 0.282034 -0.819926
C  -2.967715 1.709205 0.662212
C  5.201469 0.729915 -0.315423
C  -5.334556 1.220109 -0.79328
C  -4.022366 2.646448 0.693431
C  -5.208969 2.41001 -0.036847
H  0.05054 1.76846 0.211167
H  -0.234796 1.121855 1.857664
H  2.246262 1.685957 2.354177
H  3.388586 0.426938 1.796637
H  3.954889 2.76382 0.994047
H  2.436052 2.808755 0.061893
H  4.192554 2.170348 -1.519587
H  3.265749 0.69587 -1.215115
H  -4.367437 -0.646308 -1.39173
H  -2.074732 1.912489 1.257542
H  -6.25151 1.026275 -1.360678
H  -3.919403 3.558245 1.292081
H  -2.758474 -4.035008 -1.629008
H  -1.098849 -4.642568 -1.463111
H  -6.025551 3.140102 -0.013971
H  6.549427 -0.486813 -1.068316
