program: Gaussian 09
title: 000284283
version: EM64L-G09RevD.01
frameworkgroup: C1[X(C18H19NO3S2)]
method: RPBEPBE
basis: SDD
operation: Freq
keyword: #p
keyword: freq=noraman
keyword: PBEPBE/SDD
title: #p freq=noraman PBEPBE/SDD
converged: YES YES NO NO
title: Mulliken charges:
elementType: S S O O O N C C C C C C C C C C C C C C C C C C H H H H H H H H H H H H H H H H H H H
charge: 0.200304 0.275272 -0.369002 -0.363936 -0.235922 -0.220637 -0.295486 -0.855093 -0.657902 -0.668993 0.262748 0.374201 0.278465 -0.314325 -0.459081 -0.320564 0.442749 -0.239852 -0.232600 -0.330742 -0.431774 -0.225823 -0.215026 -0.234886 0.244592 0.208228 0.337947 0.253121 0.260356 0.260690 0.248170 0.281996 0.217040 0.244674 0.240820 0.232426 0.228902 0.260027 0.228140 0.395482 0.234151 0.229208 0.231934
chargesum: 0.00000
title: Mulliken charges with hydrogens summed into heavy atoms:
elementType: S S O O O N C C C C C C C C C C C C C C C C C C
charge: 0.200304 0.275272 -0.369002 0.031546 -0.235922 -0.220637 0.157334 -0.517146 -0.144425 -0.160134 0.262748 0.374201 0.278465 -0.032329 0.002633 -0.079745 0.442749 -0.007426 -0.003698 -0.070716 -0.203635 0.008328 0.014181 -0.002951
polarizability: 3.14829950e+02 1.92571461e+01 2.34653573e+02 -3.33267359e+00 1.60713168e+00 1.86186367e+02
1716.lowfreq: -7.0649 -2.3520 -0.0017 0.0008 0.0011 5.6496 8.9836 20.5667 31.5521
frequency: 7.1673 20.3026 31.5312 36.3677 39.5910 52.6471 68.7728 96.8404 124.9171 142.5369 154.1600 164.4824 173.6826 190.4458 213.9747 226.9130 257.0147 300.6591 305.0861 314.0669 321.1039 347.4531 377.5385 392.1052 402.2881 437.2387 454.2014 460.1902 497.1840 510.9215 530.0486 549.8751 557.9253 579.9964 596.9671 614.1795 617.2214 623.4737 631.2393 664.0608 703.3270 721.0102 726.4589 743.6165 749.3966 760.5529 771.7362 802.5260 818.3895 841.4441 857.7258 858.5818 904.1516 917.3767 928.4785 938.4401 962.3573 973.0305 981.5717 989.0932 995.3205 999.7800 1005.2170 1026.2678 1031.4021 1047.8043 1072.7355 1089.0018 1109.1045 1113.7268 1173.1960 1174.5174 1177.9569 1179.6951 1189.2745 1197.5069 1205.5463 1207.1930 1235.5526 1240.6133 1252.6803 1279.1636 1281.2543 1297.9059 1317.9374 1324.9328 1347.6529 1348.6844 1384.1471 1387.2339 1428.8330 1431.0444 1433.3829 1440.4100 1443.8023 1445.1178 1473.0867 1485.3178 1489.1908 1568.4576 1594.6458 1596.3324 1604.1621 1615.2540 2961.6726 2996.1996 3005.9179 3007.6732 3049.1982 3064.8235 3064.8494 3086.6130 3091.6836 3112.8907 3129.0374 3138.2919 3139.8526 3150.6761 3159.4737 3166.7845 3176.0727 3193.3725 3286.8895
redmass: 6.0216 7.0962 4.4208 5.7266 4.4305 5.4967 7.5154 5.1257 6.6944 5.4697 5.9753 3.5388 4.3837 5.7225 5.8986 6.6607 6.1121 6.3273 2.4114 2.3458 4.4777 5.5703 10.8518 4.9948 2.8433 2.5185 2.8885 3.3234 4.7362 3.9996 1.8386 2.6170 5.6335 5.4180 4.5649 5.7589 6.2590 5.9057 6.1617 5.8106 2.1510 4.5869 4.0269 1.8560 1.3070 6.7012 3.9693 3.9524 1.4535 1.4338 1.2694 2.6573 2.0971 1.3470 1.4749 4.1148 7.6722 1.3195 1.4010 5.2681 1.7180 1.9536 1.5002 2.1971 3.5867 2.6757 2.1396 1.5649 2.2823 1.0914 1.2841 1.0581 1.5976 1.1609 1.1408 1.0907 2.2405 1.9429 1.3799 1.5150 1.3350 1.3531 1.3959 1.1630 1.3375 2.0686 1.4324 1.3729 9.7096 6.0612 1.0837 1.0856 1.9328 2.1458 1.1124 2.0130 1.1666 2.0790 2.7980 8.6453 7.0958 6.3912 6.7848 6.0010 1.0650 1.0619 1.0613 1.0616 1.0935 1.0859 1.1017 1.1040 1.1041 1.0881 1.0863 1.0912 1.0863 1.0961 1.0921 1.1015 1.0959 1.0965 1.0663
irintensity: 0.1008 0.2620 0.7382 0.2795 1.0252 3.9191 1.9068 0.8784 3.8831 2.7187 0.0269 4.4659 0.5300 6.6959 0.5133 1.4501 7.2486 1.1742 0.9958 4.5387 10.5758 0.5951 0.3143 0.4320 0.5182 0.9097 3.8270 6.4888 10.2708 34.1569 201.8212 64.8876 1.6970 67.1626 4.3239 10.5982 10.7942 1.3693 8.7909 6.6113 32.2219 7.6411 9.6277 49.4993 103.2142 13.8221 22.3404 1.7744 0.6108 2.2242 1.0159 9.9186 13.2842 6.5093 2.5955 14.5338 100.8023 0.2025 1.1816 0.4514 2.1915 2.2011 0.9580 3.7404 19.3116 17.7185 0.1282 5.1475 58.6084 0.4990 27.3371 0.5178 25.6903 0.2079 3.0422 18.2635 18.5819 46.0575 8.7277 49.9325 9.1026 43.4208 8.6851 1.3148 17.3081 265.3175 0.6492 7.9411 3.6661 2.1801 9.8455 18.3905 79.4109 12.8706 12.1855 11.8004 17.5468 14.8676 115.1702 201.2429 5.8173 0.1045 10.1409 0.0301 41.0520 45.0781 28.7832 36.6259 21.5749 1.3312 9.0874 6.9459 23.9596 9.7779 0.1721 9.1715 2.0266 26.7816 23.2935 22.0111 15.2271 1.5851 138.9355
temp: 298.150 k
press: 1.00000 atm
elementType: 16 16 8 8 8 7 6 6 6 6 6 6 6 6 6 6 6 6 6 6 6 6 6 6 1 1 1 1 1 1 1 1 1 1 1 1 1 1 1 1 1 1 1
symmnumber: 1
zpe: 871836.3 jmol-1
zpe.correction: 0.332065 hartree
zpe.thermalcorrener: 0.354858 hartree
zpe.thermalcorrenthalpy: 0.355802 hartree
zpe.thermalcorrgfe: 0.276161 hartree
zpe.sumelectzpe: -1772.044328 hartree
zpe.sumelectthermal: -1772.021534 hartree
zpe.sumelectthermalent: -1772.020590 hartree
zpe.sumelectthermalfe: -1772.100231 hartree
dipole: 2.3624 -3.4137 -1.6259
dipole: 4.4585
quadrupole: -119.8780 -149.1068 -157.7864
quadrupole: 13.7011 -5.7690 -1.5823
quadrupole: 22.3791 -6.8497 -15.5294 13.7011 -5.7690 -1.5823
hfenergy: -1772.3763924 hartree
pointgroup: C01 [X(C18H19N1O3S2)]
dipole: -1.0017486 1.4384114 -0.065993 debye
polarizability: 308.1427343|20.4389006|233.5440674|-28.6408918|2.6740534|193.9830887 unknown
InChI: InChI=1S/C18H19NO3S2/c20-17(18-23-11-6-12-24-18)19(21)15-9-4-5-10-16(15)22-13-14-7-2-1-3-8-14/h1-5,7-10,18,21H,6,11-13H2
charge 0 multiplicity 1
43 atoms
S  2.55875 1.724912 -0.335018
S  4.089895 -0.480336 -2.000752
O  -1.353843 0.190596 -1.116513
O  1.00476 -0.492523 -2.033915
O  2.2624 -1.754731 1.095455
N  0.9626 -1.113308 -0.72116
C  5.121573 2.173065 -1.588032
C  3.205473 -0.067203 -0.381977
C  4.28016 2.526415 -0.345955
C  5.546177 0.693943 -1.679555
C  2.121742 -1.058368 0.04453
C  -0.243937 -1.803637 -0.387076
C  -1.478068 -1.115529 -0.583733
C  -0.25032 -3.109982 0.147086
C  -2.510966 1.116272 -1.069665
C  -2.70098 -1.73708 -0.262933
C  -2.841156 1.577313 0.33959
C  -1.474987 -3.728126 0.482229
C  -2.693599 -3.045796 0.273123
C  -1.802863 1.932162 1.237989
C  -4.189889 1.700671 0.751611
C  -2.115138 2.402939 2.531199
C  -4.502814 2.183605 2.043056
C  -3.464988 2.534424 2.93604
H  4.568387 2.453911 -2.503307
H  6.043413 2.792561 -1.556226
H  3.970763 -0.131117 0.408647
H  4.792988 2.228411 0.58703
H  4.07725 3.609966 -0.304322
H  6.221893 0.533514 -2.536727
H  6.061662 0.361351 -0.759476
H  0.702429 -3.615671 0.317121
H  -3.385114 0.654783 -1.567912
H  -2.162793 1.956609 -1.695312
H  -3.649531 -1.210246 -0.394553
H  -1.473758 -4.737691 0.904861
H  -3.644298 -3.522994 0.53339
H  -0.756674 1.824759 0.928311
H  -4.99921 1.421856 0.064242
H  0.27204 0.198624 -1.975408
H  -1.307089 2.666177 3.222398
H  -5.549606 2.276839 2.352822
H  -3.704532 2.901758 3.940095
