program: Gaussian 09
title: 000284262
version: EM64L-G09RevD.01
frameworkgroup: C1[X(C16H15ClN4O3)]
method: RPBEPBE
basis: SDD
operation: Freq
keyword: #p
keyword: freq=noraman
keyword: PBEPBE/SDD
title: #p freq=noraman PBEPBE/SDD
converged: YES YES NO NO
title: Mulliken charges:
elementType: Cl O O O N N N N C C C C C C C C C C C C C C C C H H H H H H H H H H H H H H H
charge: -0.046468 -0.224312 -0.409987 -0.246088 -0.162683 0.007867 -0.126050 -0.580963 -0.489355 0.213032 -0.392151 -0.141212 0.110796 -0.375418 0.103146 -0.488978 0.334041 -0.086360 -0.346941 -0.341868 0.217264 -0.218964 -0.244256 -0.110239 0.242920 0.245283 0.207576 0.290062 0.232705 0.204903 0.256403 0.274946 0.289861 0.238384 0.258346 0.256699 0.329332 0.340723 0.378005
chargesum: 0.00000
title: Mulliken charges with hydrogens summed into heavy atoms:
elementType: Cl O O O N N N N C C C C C C C C C C C C C C C C
charge: -0.046468 -0.224312 -0.031982 -0.246088 -0.162683 0.007867 -0.126050 0.089092 -0.001152 0.213032 0.105487 -0.141212 0.110796 0.062190 0.103146 0.042371 0.334041 -0.086360 -0.057081 -0.103483 0.217264 0.039382 0.012443 -0.110239
polarizability: 3.29460444e+02 3.62351755e+01 2.57759141e+02 -1.94376583e+01 1.82436502e+01 1.18014677e+02
1716.lowfreq: -10.4100 -5.1511 0.0013 0.0017 0.0017 2.4815 7.2253 12.6656 22.5196
frequency: -8.2182 11.3543 22.4455 45.9744 53.9667 58.6385 69.7270 93.1834 118.2251 147.0109 176.5287 184.4034 205.3130 234.5204 248.7920 254.0209 272.5017 300.7426 314.6372 320.0671 338.2645 392.5195 397.8632 408.3577 448.1755 461.7307 472.3351 488.6960 495.0759 503.6667 537.8880 551.6575 563.1521 597.5453 613.0936 630.3749 634.8611 664.6620 674.9855 706.4643 730.1815 750.7105 757.7316 788.9726 792.9551 807.0399 818.1793 844.3099 854.1678 883.6977 896.3943 946.2244 975.4044 989.3156 994.1806 997.0471 998.0330 1017.3862 1044.4486 1047.6229 1075.6818 1097.4960 1112.9113 1119.8658 1140.0357 1172.1399 1181.9054 1186.9468 1201.5016 1232.5673 1254.2317 1269.3179 1287.8603 1292.5586 1296.4096 1326.9807 1348.2142 1352.4505 1353.6176 1375.7726 1381.7194 1388.6700 1400.2076 1442.7423 1452.3233 1463.3553 1474.5107 1475.3017 1485.7838 1527.8948 1562.6086 1582.8024 1598.7564 1610.9246 1648.6103 1665.3169 2940.7566 2982.6594 2989.8749 2996.0933 3007.5753 3051.9431 3066.3830 3075.1065 3161.1898 3164.5474 3179.6586 3198.8394 3518.8190 3558.3958 3717.0280
redmass: 5.4686 4.1672 7.4505 9.0833 8.7009 5.7880 7.9782 6.2676 5.8363 5.3960 6.3329 4.6190 5.5550 7.6392 3.5436 4.7130 4.6542 4.9865 3.4688 3.0306 3.7244 4.8605 3.2980 2.9039 4.1924 4.7869 3.2868 1.3196 2.0268 2.8763 1.6316 1.9674 3.8538 5.0490 4.9139 6.5578 1.4406 5.3903 6.2456 6.3844 3.4279 7.6541 3.0246 5.5377 6.1062 5.5844 1.4643 2.9971 1.4943 2.6295 4.3354 1.3847 2.9681 1.7891 2.2703 2.4974 1.6608 2.2069 3.3161 2.6715 2.7371 2.3992 1.3516 3.3779 2.1292 1.1945 1.1309 1.1374 1.7776 4.4489 1.9190 1.5692 3.2989 1.4735 1.6198 4.5001 4.0758 1.6365 1.3850 1.7506 6.4420 2.2285 3.7535 1.0867 1.0915 1.0874 1.9713 1.3541 2.9018 8.7352 6.6474 7.3193 4.4852 1.8097 10.6824 8.0582 1.0576 1.1027 1.0622 1.0635 1.0640 1.0997 1.0970 1.0998 1.0888 1.0905 1.0962 1.0926 1.0640 1.0443 1.1058
irintensity: 0.1927 0.1635 0.1562 2.5404 1.4772 0.9019 0.9773 4.1192 3.3546 1.1385 1.7512 1.1639 4.6852 0.0491 6.3542 5.1891 0.8167 0.4076 0.6112 8.1161 0.8935 2.6611 10.0565 0.5924 3.9467 59.3421 1.7307 287.3491 17.6750 40.5987 2.1268 13.3067 6.4696 9.6996 2.6847 1.3115 127.8314 4.3617 2.7926 10.5701 5.1993 28.0302 31.9685 3.2109 20.5359 5.7967 6.6649 15.9666 38.2456 20.2717 3.4540 0.4064 4.6316 0.1101 9.2260 31.5815 11.5960 2.9482 13.3869 245.7231 49.6507 7.8927 13.1806 8.7251 39.4363 12.3366 4.5663 13.5024 17.5615 49.0500 24.2099 10.3935 0.1967 14.7552 24.6714 13.1814 57.2276 18.1224 30.3151 36.1619 8.9714 44.0407 1.7750 29.9376 11.3009 25.5514 89.5381 55.2866 140.4133 276.5489 171.4839 39.1113 118.2959 534.5974 296.2830 190.2753 39.8841 15.8488 17.6095 51.8351 16.4509 12.1455 20.9725 8.6319 0.6131 1.8591 7.1851 6.6108 28.0646 142.9632 48.1034
temp: 298.150 k
press: 1.00000 atm
elementType: 17 8 8 8 7 7 7 7 6 6 6 6 6 6 6 6 6 6 6 6 6 6 6 6 1 1 1 1 1 1 1 1 1 1 1 1 1 1 1
symmnumber: 1
zpe: 766185.9 jmol-1
zpe.correction: 0.291825 hartree
zpe.thermalcorrener: 0.312580 hartree
zpe.thermalcorrenthalpy: 0.313524 hartree
zpe.thermalcorrgfe: 0.239513 hartree
zpe.sumelectzpe: -1521.766518 hartree
zpe.sumelectthermal: -1521.745763 hartree
zpe.sumelectthermalent: -1521.744819 hartree
zpe.sumelectthermalfe: -1521.818830 hartree
dipole: -2.9659 -0.9656 1.3240
dipole: 3.3885
quadrupole: -168.7755 -125.3675 -149.0542
quadrupole: -14.4218 8.4133 4.2346
quadrupole: -21.0431 22.3649 -1.3218 -14.4218 8.4133 4.2346
hfenergy: -1522.0583431 hartree
pointgroup: C01 [X(C16H15Cl1N4O3)]
dipole: -1.13619 0.5565608 -0.4201659 debye
polarizability: 324.9169847|-44.712738|244.6059201|14.0312004|48.7125389|135.7113572 unknown
InChI: InChI=1S/C16H15ClN4O3/c17-10-5-3-9(4-6-10)13-11-8-21(7-1-2-12(22)23)15(24)14(11)20-16(18)19-13/h3-6,22H,1-2,7-8,18H2
charge 0 multiplicity 1
39 atoms
Cl -6.728803 2.599243 0.198213
O  3.156243 -1.428293 0.403735
O  5.9998 0.568358 -1.326958
O  5.900573 1.284866 0.87743
N  1.722243 0.396613 0.892196
N  0.508867 -2.672768 -0.561835
N  -1.866724 -2.077748 -0.757814
N  -1.060927 -4.166926 -1.447537
C  0.293686 0.756633 0.796876
C  -0.333586 -0.481432 0.182013
C  2.73006 1.285611 1.48397
C  0.68672 -1.446388 -0.027983
C  2.015566 -0.892438 0.425375
C  3.245457 2.375227 0.510387
C  -1.654536 -0.83308 -0.210039
C  4.03906 1.798581 -0.678231
C  -2.863195 0.032053 -0.092078
C  -0.805554 -2.931865 -0.90602
C  -4.099442 -0.443038 -0.613917
C  -2.845185 1.314531 0.52261
C  5.374033 1.212007 -0.255264
C  -5.275343 0.326204 -0.532875
C  -4.014517 2.098324 0.613933
C  -5.21582 1.592592 0.083042
H  -0.109183 0.981662 1.806984
H  0.153213 1.659702 0.167037
H  2.296128 1.764604 2.383039
H  3.57555 0.654764 1.809716
H  3.893802 3.061392 1.086394
H  2.395141 2.97117 0.12564
H  4.244019 2.582626 -1.432983
H  3.472418 1.008978 -1.203858
H  -4.110192 -1.431119 -1.08123
H  -1.928651 1.724881 0.949132
H  -6.219111 -0.049063 -0.938634
H  -3.990866 3.082236 1.090862
H  -2.010047 -4.41172 -1.714644
H  -0.28911 -4.818433 -1.565195
H  6.85161 0.159654 -1.013394
