program: Gaussian 09
title: 000284217
version: EM64L-G09RevD.01
frameworkgroup: C1[X(C13H11NO2)]
method: RPBEPBE
basis: SDD
operation: Freq
keyword: #p
keyword: freq=noraman
keyword: PBEPBE/SDD
title: #p freq=noraman PBEPBE/SDD
converged: NO YES NO NO
title: Mulliken charges:
elementType: O O N C C C C C C C C C C C C C H H H H H H H H H H H
charge: -0.271656 -0.201897 -0.236815 0.066076 -0.426847 -0.379227 -0.543500 0.391065 0.252597 0.132980 -0.425664 0.310454 -0.399627 -0.456555 -0.263400 -0.176525 0.222297 0.227692 0.239064 0.275387 0.235934 0.227915 0.238335 0.301176 0.250644 0.235146 0.174950
chargesum: 0.00000
title: Mulliken charges with hydrogens summed into heavy atoms:
elementType: O O N C C C C C C C C C C C C C
charge: -0.271656 -0.201897 -0.236815 0.066076 0.023142 0.135224 -0.079651 0.391065 0.252597 0.132980 -0.187329 0.310454 -0.098451 -0.205911 -0.028254 -0.001575
polarizability: 1.91078190e+02 3.53104747e+00 2.04877120e+02 3.04586558e+00 -4.09173134e-02 7.11061933e+01
1716.lowfreq: -11.5453 -7.1646 -0.0006 0.0003 0.0004 3.7493 56.8412 74.4335 108.2922
frequency: 56.8291 74.3972 108.2920 164.8134 184.9514 206.9569 255.5243 299.1593 325.4473 330.1392 351.1199 402.5940 432.8851 448.5175 464.1165 511.1643 524.2102 545.2701 576.7178 623.8269 649.6271 690.3519 738.7125 764.0606 767.4238 806.1113 848.4649 870.1014 891.2689 900.9934 933.1949 940.3775 979.3809 1000.1134 1008.4012 1033.0069 1077.6213 1091.7308 1112.5816 1155.9093 1176.0055 1186.4017 1193.8878 1206.0536 1247.2361 1254.5002 1291.2546 1298.7015 1330.7884 1350.8969 1369.8852 1378.8184 1395.0569 1411.5178 1434.9923 1461.9225 1469.8796 1477.5382 1488.8064 1539.3237 1579.9675 1607.0852 1614.1045 1627.3509 2880.7044 2967.6018 2986.5057 3006.1535 3044.9791 3069.7579 3082.0149 3124.0659 3153.6094 3156.2850 3184.2551
redmass: 6.3490 2.5761 6.8185 3.3357 3.2040 8.7078 3.1398 2.9120 3.7705 3.6845 7.9585 4.1943 3.9052 5.9127 4.7597 4.2940 5.5250 3.8591 3.1685 3.8182 5.8998 3.8157 5.1070 3.9348 3.2342 1.6352 2.2300 1.5987 1.4738 3.3573 3.0198 1.3641 1.8417 1.3312 4.2230 2.6031 1.9268 2.2434 2.2495 1.8991 1.9011 1.4306 1.7436 1.6568 1.4105 1.6453 1.6551 2.4811 1.5321 1.4438 2.0569 2.4640 2.7403 1.6941 2.5194 1.2067 1.0946 2.4359 1.2596 8.2578 7.0616 6.4825 7.9550 7.4737 1.0851 1.0663 1.0686 1.0616 1.0941 1.1010 1.0968 1.0891 1.0915 1.0930 1.0965
irintensity: 0.0197 0.1295 13.7807 8.9031 0.5918 8.9626 0.1349 7.9290 5.0644 1.4727 2.2361 0.9261 1.4000 2.4485 2.1744 5.9900 7.3991 0.2902 1.7592 1.3151 7.6564 0.5632 31.0106 13.1636 18.5857 32.2734 6.6455 7.1521 25.0187 8.2861 20.1200 0.7989 6.2523 2.9295 15.5531 11.0842 3.7781 4.6567 10.2077 35.5125 3.1186 2.9641 6.3463 13.6703 4.3895 7.9693 18.1506 25.9997 14.3223 0.7220 1.2311 10.7461 4.5582 54.3557 26.5350 14.4639 11.2416 25.8639 7.4633 62.4833 142.5930 114.9942 159.8777 119.0515 114.5109 24.4912 19.1822 27.1654 30.2655 36.7857 9.4154 13.0402 0.6457 15.5940 12.2507
temp: 298.150 k
press: 1.00000 atm
elementType: 8 8 7 6 6 6 6 6 6 6 6 6 6 6 6 6 1 1 1 1 1 1 1 1 1 1 1
symmnumber: 1
zpe: 551444.2 jmol-1
zpe.correction: 0.210034 hartree
zpe.thermalcorrener: 0.222405 hartree
zpe.thermalcorrenthalpy: 0.223349 hartree
zpe.thermalcorrgfe: 0.171371 hartree
zpe.sumelectzpe: -706.084769 hartree
zpe.sumelectthermal: -706.072398 hartree
zpe.sumelectthermalent: -706.071454 hartree
zpe.sumelectthermalfe: -706.123432 hartree
dipole: -3.4088 2.5562 0.0048
dipole: 4.2607
quadrupole: -91.2568 -98.9478 -93.8183
quadrupole: -10.9245 -0.1207 -0.8238
quadrupole: 3.4175 -4.2735 0.8560 -10.9245 -0.1207 -0.8238
hfenergy: -706.2948028 hartree
pointgroup: C01 [X(C13H11N1O2)]
dipole: -1.4177152 -0.8932101 -0.0475308 debye
polarizability: 190.6731804|-2.3745323|205.353104|0.4241455|0.8051231|71.0352196 unknown
InChI: InChI=1S/C13H11NO2/c15-8-10-7-12(16)14-6-2-4-9-3-1-5-11(10)13(9)14/h1,3,5,7-8H,2,4,6H2
charge 0 multiplicity 1
27 atoms
O  -0.480099 3.380111 0.138165
O  3.993774 -0.670717 0.039441
N  -0.9367 1.073989 0.080712
C  -0.511301 -0.27249 0.069027
C  -3.234998 0.347259 -0.586984
C  -2.387637 1.418105 0.110522
C  -2.966304 -1.026495 0.056986
C  -1.475872 -1.331509 0.066877
C  0.898319 -0.578229 0.063578
C  -0.043367 2.183395 0.095409
C  -1.016948 -2.660798 0.063859
C  1.840765 0.535819 0.063015
C  1.314103 -1.941656 0.067984
C  1.374476 1.84049 0.07269
C  0.365556 -2.973447 0.071026
C  3.328661 0.397433 0.051199
H  -4.3010 0.623129 -0.496639
H  -2.987861 0.317926 -1.664835
H  -2.698108 1.531958 1.168365
H  -2.483784 2.410145 -0.3597
H  -3.507405 -1.827174 -0.478761
H  -3.356762 -1.021647 1.095777
H  -1.756861 -3.470465 0.052951
H  2.384407 -2.158526 0.066777
H  2.062117 2.693331 0.072204
H  0.691402 -4.018295 0.072158
H  3.855627 1.38486 0.0526
