program: Gaussian 09
title: 000284212
version: EM64L-G09RevD.01
frameworkgroup: C1[X(C8H10O5)]
method: RPBEPBE
basis: SDD
operation: Freq
keyword: #pfreq=noraman
keyword: PBEPBE/SDD
title: #p freq=noraman PBEPBE/SDD
converged: YES YES NO NO
title: Mulliken charges:
elementType: O O O O O C C C C C C C C H H H H H H H H H H
charge: -0.219744 -0.248730 -0.248832 -0.237399 -0.237392 -0.035468 -0.035742 -0.225191 -0.225132 0.321011 0.321174 -0.751356 -0.751425 0.273566 0.273597 0.261520 0.261537 0.255889 0.250048 0.246016 0.250175 0.255873 0.246004
chargesum: 0.00000
title: Mulliken charges with hydrogens summed into heavy atoms:
elementType: O O O O O C C C C C C C C
charge: -0.219744 -0.248730 -0.248832 -0.237399 -0.237392 0.238098 0.237855 0.036328 0.036404 0.321011 0.321174 0.000597 0.000627
polarizability: 1.36421780e+02 -5.04875594e-03 9.49120658e+01 -1.02462225e-02 -7.04494627e-01 8.19583203e+01
1716.lowfreq: -9.2013 -5.2708 -0.0010 -0.0007 -0.0006 10.9035 26.2510 36.0718 43.8724
frequency: 26.2472 36.0503 43.8475 64.4943 65.8676 79.7283 114.3322 126.0286 196.6430 260.2209 302.0056 341.2540 367.5720 424.1237 488.8999 538.9090 558.2461 562.2018 599.2284 601.4072 719.8209 763.5512 768.7097 837.9205 856.5212 878.4216 895.3019 900.7618 929.1527 958.5882 986.9289 997.2427 1034.5196 1041.4341 1043.5296 1043.6057 1106.4187 1178.1047 1188.6710 1250.0480 1307.5626 1325.0408 1325.1109 1336.7224 1383.2767 1383.9143 1450.7875 1452.2591 1453.1637 1453.4807 1628.6042 1666.0269 1668.2873 3008.6447 3008.9301 3062.5570 3066.5084 3099.5359 3099.6592 3143.8096 3144.1224 3196.5474 3226.7141
redmass: 6.8512 3.7142 3.4597 1.3188 1.1773 2.9520 4.7609 4.3367 6.7473 5.2063 4.1705 3.8095 4.8657 4.6849 4.2827 3.5813 3.2754 3.3236 5.6553 5.7595 1.8301 6.5459 5.1191 6.6790 4.5351 6.5903 3.9797 5.0749 1.9264 1.7491 2.0016 1.9492 2.0571 2.4935 1.6786 2.0101 1.2057 3.0258 3.2533 1.3083 1.8003 1.3783 1.1542 1.5121 1.2446 1.2458 1.0567 1.0550 1.0506 1.0517 6.7806 9.7061 9.8807 1.0373 1.0371 1.0854 1.0878 1.0960 1.0957 1.1019 1.1018 1.0881 1.1097
irintensity: 0.8847 1.1981 2.7258 0.0306 0.4138 1.9180 7.1416 7.4116 2.3360 4.3485 1.4612 10.3813 12.4173 2.5017 12.7041 0.1614 10.4396 0.4594 0.0231 2.5295 14.1079 291.3677 3.1388 37.6633 45.5163 415.5441 0.0526 218.6462 144.0329 80.5671 82.7157 4.7506 39.8789 51.0647 6.6942 2.8992 27.2460 365.5685 193.6092 5.4860 1.5207 4.3822 7.1147 10.4953 8.9675 98.9099 12.9135 39.9576 22.0367 15.2687 0.0450 166.6202 270.8137 1.1741 1.3843 3.3700 24.3027 6.4927 7.0504 11.7271 9.1181 0.0082 3.0242
temp: 298.150 k
press: 1.00000 atm
elementType: 8 8 8 8 8 6 6 6 6 6 6 6 6 1 1 1 1 1 1 1 1 1 1
symmnumber: 1
zpe: 449005.3 jmol-1
zpe.correction: 0.171017 hartree
zpe.thermalcorrener: 0.184831 hartree
zpe.thermalcorrenthalpy: 0.185775 hartree
zpe.thermalcorrgfe: 0.127362 hartree
zpe.sumelectzpe: -685.958654 hartree
zpe.sumelectthermal: -685.944841 hartree
zpe.sumelectthermalent: -685.943897 hartree
zpe.sumelectthermalfe: -686.002309 hartree
dipole: 0.0040 0.1003 -4.3486
dipole: 4.3498
quadrupole: -77.8517 -61.5153 -81.6201
quadrupole: -0.0179 -0.0203 0.6738
quadrupole: -4.1894 12.1471 -7.9577 -0.0179 -0.0203 0.6738
hfenergy: -686.1296712 hartree
pointgroup: C01 [X(C8H10O5)]
dipole: 0.0026778 0.4378041 -1.6543731 debye
dipolederiv: -1.2474557 0.0040522 -0.0005852 0.003643 -0.4809105 0.0970231 -0.0015352 -0.1209888 -0.3876414 -1.4646816 -0.5990442 0.0305525 -1.087818 -0.9020409 -0.0458141 -0.1606655 -0.0937383 -0.5035905 -1.4471208 0.6041905 -0.0343298 1.0927964 -0.9188826 -0.0423331 0.1570324 -0.0937635 -0.5031508 -0.7817923 -0.213051 0.1462588 -0.1473459 -0.4544709 -0.1554853 0.5037445 0.049145 -0.7955502 -0.7770471 0.2154689 -0.1481612 0.1502191 -0.4589005 -0.1542458 -0.5033723 0.0537861 -0.7966735 1.2600577 0.1860039 0.1611838 0.3779717 0.7010693 0.0531484 0.762608 0.3343985 0.4998326 1.2561502 -0.1923781 -0.1587414 -0.3831476 0.7067261 0.0535497 -0.7577742 0.3417277 0.497577 -0.0578722 0.0157153 0.012827 0.0526076 -0.0824822 -0.1002451 -0.0079396 -0.1181289 -0.1569676 -0.0584645 -0.0156728 -0.0136222 -0.0526483 -0.081725 -0.1002312 0.0071116 -0.1183151 -0.156917 1.5857313 0.7583694 -0.2457767 0.8345848 0.8810951 0.2629135 -0.7048794 0.0117007 1.0233924 1.5664265 -0.7640299 0.2515902 -0.8415706 0.899957 0.259398 0.7082195 0.0031373 1.0232708 -0.0671153 -0.0559748 -0.011344 -0.1497802 -0.2030331 -0.21116 -0.0812836 -0.2082504 -0.2074332 -0.0647646 0.0551829 0.0085868 0.1506008 -0.2107352 -0.2135696 0.0767733 -0.2066034 -0.2022637 0.0111837 0.0758894 0.0531265 -0.0445261 0.0571897 0.0035415 -0.0629119 -0.0692606 0.0250932 0.0109416 -0.0753263 -0.053089 0.0449534 0.057521 0.0041663 0.0622678 -0.0700665 0.0252056 0.0604941 0.0650294 -0.0343908 0.0422337 0.0650321 0.0754239 -0.0366971 0.094822 0.1298264 0.0593259 -0.0651446 0.0349619 -0.0423248 0.066094 0.0750004 0.0374541 0.0943293 0.129971 0.0205092 0.0939948 -0.0174504 0.070404 0.0275608 -0.0248892 -0.0143461 -0.0028421 0.1198626 0.1209418 -0.0367429 -0.0135332 0.0054943 0.0644206 0.1011366 -0.0101816 0.0622625 -0.0223664 -0.0636308 -0.0934355 0.0165253 -0.0813134 0.08574 -0.0076717 0.0469897 -0.0005812 0.0821135 0.1210284 0.037743 0.0109958 -0.0044533 0.0669038 0.1004999 0.0080516 0.0608087 -0.0248723 0.0221251 -0.093754 0.019885 -0.0705614 0.0268337 -0.0224202 0.0173635 -0.0011377 0.118687 -0.0649705 0.0929145 -0.0154697 0.0799807 0.0870378 -0.0077358 -0.0460297 -0.0024412 0.0825945 unknown
polarizability: 136.4204751|-0.2275034|93.5354272|0.0941899|4.0549427|83.3362635 unknown
InChI: InChI=1S/C8H10O5/c1-5(9)11-7-3-4-8(13-7)12-6(2)10/h3-4,7-8H,1-2H3
charge 0 multiplicity 1
23 atoms
O  0.002041 0.318918 1.031838
O  -1.847468 0.068839 -0.520051
O  1.852199 0.050705 -0.516232
O  -3.478462 -0.509549 1.06667
O  3.474221 -0.542908 1.074036
C  -1.1850 0.964081 0.466032
C  1.196421 0.952527 0.468443
C  -0.66473 2.172598 -0.27494
C  0.689441 2.166023 -0.273567
C  -2.969552 -0.667554 -0.060952
C  2.965776 -0.696779 -0.054399
C  -3.414844 -1.634792 -1.131925
C  3.402409 -1.670837 -1.122749
H  -1.890585 1.139199 1.296389
H  1.902028 1.120803 1.300197
H  -1.327864 2.890933 -0.75751
H  1.360523 2.877855 -0.75478
H  -2.684569 -2.460738 -1.203527
H  -3.445418 -1.137358 -2.115058
H  -4.402189 -2.045762 -0.876534
H  3.41683 -1.182918 -2.110826
H  2.676118 -2.501824 -1.175859
H  4.394973 -2.074863 -0.876395
