program: Gaussian 09
title: 000284241
version: EM64L-G09RevD.01
frameworkgroup: C1[X(C10H11N3O6S)]
method: RPBEPBE
basis: SDD
operation: Freq
keyword: #p
keyword: freq=noraman
keyword: PBEPBE/SDD
title: #p freq=noraman PBEPBE/SDD
converged: YES YES NO NO
title: Mulliken charges:
elementType: S O O O O O O N N N C C C C C C C C C C H H H H H H H H H H H
charge: 0.301752 -0.265500 -0.458200 -0.437807 -0.434067 -0.266567 -0.200878 -0.150035 -0.411604 0.067002 -0.187729 -0.087257 -0.170036 -0.062199 -0.349181 -0.244822 0.233607 0.149428 0.145740 -0.423611 0.282072 0.261173 0.283441 0.284471 0.185466 0.238200 0.363967 0.347796 0.372530 0.352645 0.280206
chargesum: 0.00000
title: Mulliken charges with hydrogens summed into heavy atoms:
elementType: S O O O O O O N N N C C C C C C C C C C
charge: 0.301752 -0.265500 -0.094233 -0.090011 -0.081421 -0.266567 -0.200878 -0.150035 -0.039074 0.067002 0.094343 0.173917 0.113405 0.222272 0.074484 -0.244822 0.233607 0.149428 0.145740 -0.143405
polarizability: 2.17785172e+02 -5.07502472e+00 1.71316770e+02 1.26472879e+01 -3.90378843e+00 1.04337837e+02
1716.lowfreq: -11.4412 -6.7572 -0.0020 -0.0015 0.0013 7.5735 25.6610 29.3035 39.5055
frequency: 25.1371 29.2866 39.3740 55.1938 85.6253 99.1637 120.5264 141.0068 145.8416 175.3295 179.5653 199.9735 249.3907 294.8821 299.7290 308.7841 329.4522 348.3593 394.4075 415.6987 429.9866 435.6176 457.7650 493.3089 521.7692 547.8342 558.6769 575.2852 593.9431 598.4391 658.6329 697.5739 704.7757 715.9688 719.7015 749.0674 757.1135 761.7355 783.6634 805.2088 831.3809 870.5200 896.6686 931.9516 961.8581 971.6898 998.7669 1020.0462 1046.8920 1058.3715 1110.3330 1114.1635 1126.4200 1190.3911 1191.9396 1206.0365 1207.0307 1240.9982 1255.5697 1264.0245 1276.7468 1284.9363 1290.2955 1309.5959 1339.9998 1353.0922 1367.9021 1379.8265 1385.8123 1390.4795 1428.5997 1450.4321 1479.1306 1493.8685 1635.4369 1667.4338 2974.8405 3054.5482 3060.8332 3064.4807 3098.5645 3120.5518 3232.6004 3519.7722 3519.9069 3548.7545 3554.6525
redmass: 4.9459 4.2007 6.2805 2.5887 3.2317 2.9694 10.6636 4.6086 8.4582 7.5141 4.3948 8.0967 5.3105 5.6699 8.8009 5.5330 5.7729 15.2700 5.0243 2.8560 1.5601 13.2081 6.1483 4.4681 7.2098 9.0180 1.1549 7.8524 5.6876 5.9222 6.5315 3.2396 6.8925 4.1529 2.7704 4.7277 1.6216 3.9715 2.7580 3.7406 4.4424 5.8947 6.4797 4.0003 3.4960 3.6256 3.2834 3.5643 4.2130 4.1616 4.9496 1.9707 4.8309 1.3108 1.1779 1.3186 1.3280 1.3424 1.8717 2.9493 1.2416 3.5101 1.4468 1.3329 1.1864 1.3848 1.6145 1.1804 1.3185 1.7705 3.2009 1.0888 10.3356 10.5917 7.8713 7.3377 1.0686 1.0851 1.0865 1.0871 1.0953 1.0885 1.0979 1.0706 1.0714 1.0656 1.0659
irintensity: 24.0000 31.1016 6.9081 146.1179 52.3177 49.5586 5.7948 12.1862 2.9266 12.0080 1.3416 8.8291 16.0114 13.2709 0.9515 1.5292 2.0406 7.8063 3.6794 24.2660 188.9222 5.6638 4.8098 7.4941 4.4968 34.4227 0.9059 3.5740 0.6171 13.3424 42.7105 1.0765 11.8006 3.5826 4.8963 29.1537 93.9982 43.2832 49.4150 131.2660 13.2273 10.3964 34.4444 9.1842 170.9370 80.5948 70.4582 143.2773 31.1364 28.5836 33.6338 16.3807 47.0302 12.9157 23.4342 12.0090 37.8800 24.8967 52.3260 86.2935 1.9425 47.9161 13.6037 2.4350 15.0112 16.4643 27.4337 17.2456 31.4402 37.7019 179.2645 7.7223 6.1591 127.2222 534.6489 565.1929 52.5782 9.7918 12.3638 14.0043 14.0366 10.7959 3.7175 64.8150 23.7667 21.5830 8.3611
temp: 298.150 k
press: 1.00000 atm
elementType: 16 8 8 8 8 8 8 7 7 7 6 6 6 6 6 6 6 6 6 6 1 1 1 1 1 1 1 1 1 1 1
symmnumber: 1
zpe: 575887.9 jmol-1
zpe.correction: 0.219344 hartree
zpe.thermalcorrener: 0.237865 hartree
zpe.thermalcorrenthalpy: 0.238809 hartree
zpe.thermalcorrgfe: 0.170923 hartree
zpe.sumelectzpe: -1399.816153 hartree
zpe.sumelectthermal: -1399.797633 hartree
zpe.sumelectthermalent: -1399.796689 hartree
zpe.sumelectthermalfe: -1399.864575 hartree
dipole: -1.5482 -3.4046 -2.7998
dipole: 4.6720
quadrupole: -150.4301 -117.5207 -126.6469
quadrupole: -9.7331 8.2917 -4.1052
quadrupole: -18.8976 14.0119 4.8857 -9.7331 8.2917 -4.1052
hfenergy: -1400.0354976 hartree
pointgroup: C01 [X(C10H11N3O6S1)]
dipole: 0.476756 -1.7527787 0.2811345 debye
polarizability: 213.6103811|-9.3703767|149.9729813|23.5144694|30.0220945|129.8564166 unknown
InChI: InChI=1S/C10H11N3O6S/c14-1-3-5(15)6(16)8(19-3)13-9-4(11-2-20-9)7(17)12-10(13)18/h2-3,5-6,8,12,14-16H,1H2
charge 0 multiplicity 1
31 atoms
S  -1.791408 -1.915622 -1.563837
O  1.675676 -0.191299 -0.862411
O  1.847222 -2.605239 1.321605
O  4.085669 -1.208541 1.297474
O  3.744519 1.307098 -2.200222
O  0.517913 1.428963 1.659249
O  -3.992697 2.108562 0.66816
N  -0.502542 -0.146243 0.243713
N  -1.740731 1.688554 1.128925
N  -3.920414 -0.32812 -1.130175
C  1.579286 -1.160334 1.353273
C  0.78909 -0.882956 0.051514
C  2.917778 -0.326794 1.232276
C  2.785542 0.476558 -0.087235
C  4.002006 0.488133 -1.01306
C  -1.652715 -0.505404 -0.451329
C  -0.513297 1.026859 1.051113
C  -2.870422 0.191276 -0.365254
C  -2.986006 1.384043 0.47938
C  -3.563184 -1.390697 -1.802142
H  1.022424 -0.884439 2.262946
H  0.523084 -1.849529 -0.408862
H  3.036824 0.353591 2.085191
H  2.463328 1.510301 0.125224
H  4.279507 -0.547395 -1.298878
H  4.859654 0.956189 -0.504661
H  2.423761 -2.831946 2.096811
H  3.971135 -1.929131 0.622809
H  -1.74628 2.524781 1.722994
H  2.929362 0.954642 -2.641592
H  -4.192985 -1.976363 -2.470398
