program: Gaussian 09
title: 000284264
version: EM64L-G09RevD.01
frameworkgroup: C1[X(C17H18N4O4)]
method: RPBEPBE
basis: SDD
operation: Freq
keyword: #p
keyword: freq=noraman
keyword: PBEPBE/SDD
title: #p freq=noraman PBEPBE/SDD
converged: YES YES NO NO
title: Mulliken charges:
elementType: O O O O N N N N C C C C C C C C C C C C C C C C C H H H H H H H H H H H H H H H H H H
charge: -0.229013 -0.410296 -0.258627 -0.247467 -0.161895 0.002721 -0.127800 -0.583264 -0.493493 0.204463 -0.390658 -0.143863 0.107454 -0.373934 0.106113 -0.490468 0.322906 -0.091992 -0.325530 -0.366040 0.217731 -0.397113 -0.362629 0.326575 -0.536047 0.242562 0.244379 0.205545 0.288564 0.229933 0.204954 0.254806 0.278341 0.235058 0.283448 0.252090 0.242982 0.325882 0.337591 0.376875 0.248676 0.225368 0.225110
chargesum: 0.00000
title: Mulliken charges with hydrogens summed into heavy atoms:
elementType: O O O O N N N N C C C C C C C C C C C C C C C C C
charge: -0.229013 -0.033421 -0.258627 -0.247467 -0.161895 0.002721 -0.127800 0.080210 -0.006552 0.204463 0.103451 -0.143863 0.107454 0.060953 0.106113 0.042679 0.322906 -0.091992 -0.090473 -0.082591 0.217731 -0.145023 -0.119647 0.326575 0.163108
polarizability: 3.53687173e+02 3.80364064e+01 2.62730968e+02 -1.87565637e+01 1.56866482e+01 1.25591076e+02
1716.lowfreq: -7.1017 -5.6964 -0.0005 0.0004 0.0006 4.2297 7.6619 15.1237 21.9869
frequency: -6.2928 14.4035 21.9011 46.1793 55.8106 59.6684 70.6367 87.3968 114.9072 117.7752 155.1631 180.4259 186.8185 197.1765 234.8196 236.9992 248.1961 253.5686 271.6433 310.5436 316.9889 322.2893 337.2488 395.2171 396.6266 415.3551 448.0680 465.7232 472.7140 492.0369 496.3558 504.9168 536.7471 550.2877 560.1794 570.0390 597.0689 612.5655 632.4786 636.3833 670.5966 690.8514 746.7945 751.7098 753.5637 765.3675 790.9071 793.0913 809.6216 814.6820 841.8608 846.1893 883.5229 896.8672 950.1342 974.9597 984.4006 988.0028 992.9434 994.8868 998.0460 1018.6777 1045.4533 1047.1357 1098.4993 1111.2148 1117.6374 1120.2491 1139.8403 1158.8585 1172.5802 1177.6346 1182.5725 1202.6172 1232.0789 1241.3384 1254.1344 1269.1821 1290.8920 1296.0092 1301.2143 1330.0746 1350.3748 1352.5159 1353.8568 1376.0085 1384.3881 1388.9384 1428.3605 1436.7223 1441.6761 1452.1218 1461.7413 1468.1330 1472.3406 1476.3265 1479.6436 1498.7187 1530.2691 1560.9288 1578.2336 1605.7732 1622.9710 1646.5325 1664.5173 2942.8664 2965.7501 2984.5929 2989.9174 2996.7738 3007.8531 3050.9548 3056.5576 3066.3375 3074.6783 3129.9606 3152.2315 3160.8221 3173.1513 3196.7010 3518.4218 3560.0669 3719.6213
redmass: 4.2583 4.5716 6.9557 7.4392 6.5569 5.0447 6.1886 4.6534 4.3064 4.9853 4.8355 3.6212 4.2800 4.0326 1.2891 3.6995 3.6712 4.4693 5.0920 3.1448 3.1362 3.2555 5.5844 3.3608 4.3118 2.9460 3.6745 3.4127 1.2266 2.4072 2.7250 2.8998 1.3232 2.6227 4.0836 5.2819 5.0795 4.9084 1.4699 6.1226 4.8722 5.1809 5.3119 4.2159 6.0854 3.5799 5.9140 6.6748 5.3540 1.3056 1.7349 3.0381 2.6091 4.5649 1.3902 3.0402 7.0539 1.4899 1.7319 2.0309 2.8485 2.1059 3.1359 2.7272 2.3861 1.2595 1.3509 3.4079 2.1280 1.3364 1.1859 1.2415 1.1282 1.7210 3.7453 3.5395 1.9131 1.5605 3.5498 1.8736 1.5012 3.4717 2.8968 1.8049 1.4724 1.7499 5.0825 2.3007 4.0105 1.1978 1.0864 1.0914 1.0892 1.0504 1.0831 1.2915 2.2697 2.9433 6.9739 6.4439 7.2512 1.6357 5.8369 10.6072 8.0270 1.0572 1.0327 1.1027 1.0621 1.0633 1.0639 1.1000 1.1042 1.0969 1.1002 1.0999 1.0879 1.0897 1.0952 1.0925 1.0640 1.0441 1.1058
irintensity: 0.3223 0.2003 0.2770 1.4511 0.6160 1.4548 0.8587 10.0161 0.1654 2.7474 2.2325 3.5693 2.5734 1.7441 1.1252 11.3468 2.3073 3.5694 1.5607 0.3680 4.1009 4.9149 0.9406 6.8033 4.2700 0.1202 15.2560 15.1082 268.6932 33.9145 8.1583 40.5087 1.5880 10.7959 5.8230 42.1412 9.0927 2.6228 116.2455 15.3623 5.7377 4.6812 2.5998 25.3370 13.0212 16.8273 4.1760 18.3054 5.0957 1.4355 56.3166 11.9215 18.4554 2.8638 1.2600 3.4420 60.4560 1.5653 2.4032 3.8800 9.0831 4.3511 20.4423 241.9111 17.2444 0.1918 11.3040 3.7524 46.8481 2.4171 12.9194 197.2799 3.3887 18.5244 14.5821 242.5023 24.3184 10.0370 1.9746 44.1723 0.7950 10.8636 88.5439 44.5588 60.3853 35.7595 4.8411 51.4880 5.3282 14.3309 30.9788 11.9037 25.2708 15.2080 74.2995 35.0467 107.2227 300.6724 261.1260 164.6486 71.6530 595.0758 163.8046 294.5546 190.2050 37.5257 79.6344 15.7402 18.5450 51.3629 17.5008 15.5422 43.9374 19.6480 8.3724 25.0771 7.6396 4.4645 13.9584 9.1294 27.0376 133.4439 45.4727
temp: 298.150 k
press: 1.00000 atm
elementType: 8 8 8 8 7 7 7 7 6 6 6 6 6 6 6 6 6 6 6 6 6 6 6 6 6 1 1 1 1 1 1 1 1 1 1 1 1 1 1 1 1 1 1
symmnumber: 1
zpe: 874162.6 jmol-1
zpe.correction: 0.332951 hartree
zpe.thermalcorrener: 0.355105 hartree
zpe.thermalcorrenthalpy: 0.356049 hartree
zpe.thermalcorrgfe: 0.279713 hartree
zpe.sumelectzpe: -1176.730042 hartree
zpe.sumelectthermal: -1176.707889 hartree
zpe.sumelectthermalent: -1176.706944 hartree
zpe.sumelectthermalfe: -1176.783280 hartree
dipole: -6.9423 -1.4858 1.8263
dipole: 7.3307
quadrupole: -129.1271 -130.1155 -149.2406
quadrupole: -10.7236 4.8216 2.5664
quadrupole: 7.0340 6.0455 -13.0795 -10.7236 4.8216 2.5664
hfenergy: -1177.0629934 hartree
pointgroup: C01 [X(C17H18N4O4)]
dipole: -2.7859765 0.4694465 -0.5796815 debye
polarizability: 356.9185247|-34.2196154|263.0512596|6.1499115|6.5788757|122.0394325 unknown
InChI: InChI=1S/C17H18N4O4/c1-25-11-6-4-10(5-7-11)14-12-9-21(8-2-3-13(22)23)16(24)15(12)20-17(18)19-14/h4-7,22H,2-3,8-9,18H2,1H3
charge 0 multiplicity 1
43 atoms
O  3.619253 -1.04912 0.679633
O  6.247081 0.355823 -1.786448
O  -6.116634 2.143516 0.200482
O  6.205242 1.777271 0.046536
N  2.096153 0.767859 0.673072
N  1.00435 -2.662461 0.437228
N  -1.417869 -2.27099 0.295456
N  -0.515913 -4.432633 0.25083
C  0.641813 1.011751 0.596054
C  0.062611 -0.387102 0.4893
C  3.076999 1.846841 0.843443
C  1.130973 -1.319941 0.51354
C  2.445965 -0.588752 0.630876
C  3.465987 2.547851 -0.483058
C  -1.25969 -0.904124 0.374652
C  4.234395 1.627933 -1.451922
C  -2.510758 -0.1030 0.329404
C  -0.310868 -3.075988 0.330235
C  -2.537869 1.31953 0.4290
C  -3.754894 -0.77487 0.182537
C  5.628459 1.29284 -0.952863
C  -3.74621 2.031154 0.382512
C  -4.975673 -0.07741 0.13383
C  -4.974349 1.338333 0.234359
C  -7.417445 1.480889 0.054377
H  0.393647 1.642096 -0.283012
H  0.296465 1.546885 1.505495
H  2.663396 2.592033 1.550112
H  3.978855 1.405448 1.30256
H  4.093723 3.423092 -0.231311
H  2.557164 2.929483 -0.987779
H  4.341984 2.103497 -2.44617
H  3.698811 0.676867 -1.623761
H  -1.617674 1.893721 0.548573
H  -3.734068 -1.865704 0.108885
H  -3.767377 3.122246 0.460252
H  -5.909777 -0.635401 0.019933
H  -1.462531 -4.792714 0.174046
H  0.290665 -5.050938 0.276968
H  7.140453 0.124461 -1.41325
H  -8.154775 2.296499 0.056069
H  -7.615263 0.795822 0.900937
H  -7.478404 0.923408 -0.899916
