program: Gaussian 09
title: 000028255
version: EM64L-G09RevD.01
frameworkgroup: C1[X(C9H21NO)]
method: RPBEPBE
basis: SDD
operation: Freq
keyword: #p
keyword: freq=noraman
keyword: PBEPBE/SDD
title: #p freq=noraman PBEPBE/SDD
converged: YES YES NO NO
title: Mulliken charges:
elementType: O N C C C C C C C C C H H H H H H H H H H H H H H H H H H H H H
charge: -0.456545 -0.311487 -0.459010 -0.348479 0.313602 -0.416309 -0.038105 -0.736447 -0.733894 -0.724428 -0.627995 0.195810 0.189008 0.250886 0.193459 0.187837 0.182051 0.193023 0.246746 0.196375 0.223893 0.201261 0.234650 0.210507 0.218652 0.203155 0.214776 0.242071 0.321490 0.223837 0.222355 0.187256
chargesum: 0.00000
title: Mulliken charges with hydrogens summed into heavy atoms:
elementType: O N C C C C C C C C C
charge: -0.135055 -0.069416 -0.074193 0.095866 0.313602 -0.046422 0.154918 -0.069433 -0.087476 -0.087845 0.005453
polarizability: 1.26192164e+02 2.30551633e+00 1.04803776e+02 -3.67639366e-02 4.67283119e-03 9.84172609e+01
1716.lowfreq: -2.0182 -0.0007 -0.0006 -0.0001 12.1881 22.8796 32.0075 49.4269 66.1969
frequency: 31.0307 49.3037 66.1727 99.8441 120.6712 143.2222 186.9061 199.9403 214.3357 225.6430 238.7532 244.6936 268.9220 304.4788 328.1510 339.5348 385.1620 403.6911 437.2581 451.8024 513.8804 532.4295 622.2870 740.9139 749.9612 809.2069 843.2994 877.7905 909.5412 918.9010 932.9539 969.9833 987.0283 1014.0561 1042.8581 1071.1993 1075.7242 1080.3334 1099.8564 1123.2593 1130.4088 1159.1442 1184.6802 1212.8958 1224.2027 1248.3129 1266.8918 1288.4084 1305.3751 1333.8540 1340.3135 1347.8283 1360.2899 1375.0251 1376.0379 1393.0248 1432.3389 1440.0081 1447.3556 1458.0396 1460.5252 1465.0762 1465.4784 1472.0725 1473.2369 1482.0616 1486.3354 1488.3333 1495.0792 2874.7627 2935.8750 2942.4491 2964.6843 2968.3183 2968.4841 2979.0627 2993.4780 2997.7684 3004.2096 3009.4312 3058.9310 3060.1899 3063.5229 3067.4583 3069.0665 3083.9926 3091.7198 3103.2345 3436.9851 3541.0827
redmass: 3.0753 3.6668 2.3080 2.1911 2.6312 1.7558 1.4196 1.2468 1.3070 1.7143 1.2607 1.6884 2.2528 1.1392 2.6042 2.2605 2.4934 2.1905 2.6663 2.2133 2.7690 2.9483 1.6975 3.5263 1.1955 1.5146 1.7467 2.2034 1.7922 1.6031 1.6245 1.4833 1.5971 2.2663 1.3583 2.2584 1.6374 1.9798 1.6502 1.5209 1.9344 2.3513 2.4336 2.0182 2.0023 1.4044 1.3861 1.1257 1.3107 1.3283 1.5508 1.5672 1.5553 1.2813 1.2358 1.2664 1.1304 1.1703 1.0650 1.0748 1.0624 1.0650 1.0638 1.0740 1.0919 1.0573 1.0877 1.0554 1.0414 1.0558 1.0623 1.0625 1.0402 1.0372 1.0767 1.0668 1.0394 1.0908 1.0947 1.0745 1.0987 1.0986 1.0996 1.0992 1.0994 1.0998 1.0993 1.0994 1.0740 1.0656
irintensity: 0.3371 0.2381 0.9895 2.2905 1.0686 0.4670 2.7482 1.7983 1.0415 0.7675 3.6622 3.1819 15.1182 94.9687 23.2635 47.0894 2.5459 0.9704 10.9171 14.8234 2.8618 1.5942 112.3785 5.6147 10.5472 4.1199 11.1740 17.6430 11.7859 1.4967 6.6911 0.2857 4.7140 1.3083 5.9749 0.6777 21.4864 4.4787 14.1352 36.3241 9.3480 29.4502 66.9124 8.8679 11.2866 41.9749 13.8802 3.5164 10.5988 6.6133 7.1050 7.9533 3.3453 36.7350 16.9900 22.6596 1.6297 23.0637 0.4151 2.6157 0.8696 7.1803 6.1732 5.7283 1.1333 9.7587 16.3241 10.2363 15.4297 150.1631 14.6254 33.0144 26.3159 27.4703 33.8704 45.5462 10.1546 29.0251 42.0017 48.2805 24.6714 3.4283 86.7704 67.9936 34.2408 4.5937 61.8217 30.7264 1.7749 4.6042
temp: 298.150 k
press: 1.00000 atm
elementType: 8 7 6 6 6 6 6 6 6 6 6 1 1 1 1 1 1 1 1 1 1 1 1 1 1 1 1 1 1 1 1 1
symmnumber: 1
zpe: 756532.3 jmol-1
zpe.correction: 0.288148 hartree
zpe.thermalcorrener: 0.303237 hartree
zpe.thermalcorrenthalpy: 0.304181 hartree
zpe.thermalcorrgfe: 0.246194 hartree
zpe.sumelectzpe: -484.569731 hartree
zpe.sumelectthermal: -484.554642 hartree
zpe.sumelectthermalent: -484.553697 hartree
zpe.sumelectthermalfe: -484.611684 hartree
dipole: 1.0804 -2.0090 -0.8450
dipole: 2.4325
quadrupole: -69.0617 -75.7243 -65.7372
quadrupole: 5.6868 0.1040 -0.8318
quadrupole: 1.1127 -5.5499 4.4372 5.6868 0.1040 -0.8318
hfenergy: -484.8578786 hartree
pointgroup: C01 [X(C9H21N1O1)]
dipole: -0.4196358 -0.7754688 0.3721012 debye
polarizability: 126.2250221|-2.1450023|104.7535454|0.1072915|-0.3323234|98.434633 unknown
InChI: InChI=1S/C9H21NO/c1-8(10-4)6-5-7-9(2,3)11/h8,10-11H,5-7H2,1-4H3
charge 0 multiplicity 1
32 atoms
O  2.504017 1.435458 0.678303
N  -2.681002 0.840814 0.422928
C  1.441579 -0.785012 0.294808
C  0.103848 -0.229513 -0.237876
C  2.686624 0.107195 0.023488
C  -1.109892 -1.062165 0.22701
C  -2.471393 -0.477409 -0.227495
C  2.866626 0.449279 -1.465296
C  3.95809 -0.562613 0.595213
C  -3.623082 -1.492207 0.020155
C  -3.748969 1.690431 -0.132298
H  1.628315 -1.791831 -0.133674
H  1.360103 -0.930647 1.395343
H  -0.030871 0.816624 0.092292
H  0.120033 -0.214887 -1.346322
H  -1.024017 -2.10151 -0.152539
H  -1.110336 -1.13646 1.337125
H  -2.412806 -0.278036 -1.318605
H  2.016958 1.049786 -1.82904
H  2.941386 -0.470658 -2.072861
H  3.786602 1.043051 -1.606079
H  3.830998 -0.805735 1.668549
H  4.820885 0.119086 0.49417
H  4.190724 -1.503475 0.062716
H  -4.604989 -1.062654 -0.251959
H  -3.659702 -1.783834 1.088181
H  -3.480828 -2.412685 -0.577167
H  -2.745758 0.744405 1.445881
H  2.370061 1.283333 1.649582
H  -3.520224 1.918472 -1.190312
H  -3.774958 2.651158 0.413233
H  -4.777022 1.253637 -0.099253
