program: Gaussian 09
title: 000284215
version: EM64L-G09RevD.01
frameworkgroup: C1[X(C15H16O2S)]
method: RPBEPBE
basis: SDD
operation: Freq
keyword: #p
keyword: freq=noraman
keyword: PBEPBE/SDD
title: #p freq=noraman PBEPBE/SDD
converged: YES YES NO NO
title: Mulliken charges:
elementType: S O O C C C C C C C C C C C C C C C H H H H H H H H H H H H H H H H
charge: 0.866645 -0.539876 -0.539886 -0.071141 -0.064830 0.506179 -0.247853 -0.247860 -0.533374 -0.386894 -0.386939 -0.243462 -0.243501 0.450036 -0.366877 -0.366560 -0.668711 -0.800590 0.278390 0.278408 0.215087 0.215085 0.243477 0.243477 0.278627 0.278611 0.241840 0.241834 0.223519 0.222368 0.223517 0.228735 0.228714 0.243806
chargesum: 0.00000
title: Mulliken charges with hydrogens summed into heavy atoms:
elementType: S O O C C C C C C C C C C C C C C C
charge: 0.866645 -0.539876 -0.539886 -0.071141 -0.064830 0.506179 0.030536 0.030549 -0.103202 -0.143417 -0.143462 0.035166 0.035110 0.450036 -0.125036 -0.124727 0.000692 -0.099335
polarizability: 2.40266963e+02 -7.00009491e+00 1.56964623e+02 -1.97508159e-03 1.30864591e-02 1.78788484e+02
1716.lowfreq: -41.9811 -3.5311 -0.0020 -0.0019 -0.0019 9.7227 11.1745 28.4577 28.5867
frequency: -41.8319 28.4492 28.5744 39.1535 44.8536 81.0396 113.4854 126.6561 158.1405 179.5214 216.5537 224.5869 250.8721 262.1507 292.2273 320.5730 351.8714 366.8338 402.3717 406.4135 409.1537 410.3285 468.2419 507.5176 538.3209 577.5794 604.9486 622.1887 623.7188 712.9496 729.5112 763.1329 775.1408 788.2044 790.5557 833.2185 850.7131 854.5682 855.7589 921.1160 961.2035 966.0136 970.2972 979.0720 982.8638 989.7176 994.8532 998.1156 1048.2785 1049.0759 1052.5116 1057.5201 1063.3494 1117.0559 1122.0871 1180.8117 1184.2589 1212.6042 1217.6357 1241.6811 1294.5960 1298.6394 1311.9105 1381.5841 1387.0056 1389.5225 1391.4159 1398.5135 1398.6625 1470.1817 1470.6973 1473.4057 1473.8942 1475.3245 1480.8321 1492.6027 1593.9341 1595.7497 1596.0592 1600.0424 2979.8260 2982.5730 2993.2763 3044.2032 3062.2071 3082.7101 3086.3047 3090.8462 3130.5730 3132.1728 3133.8918 3135.3262 3156.7361 3158.5125 3159.8595 3161.7930
redmass: 1.0110 2.8702 4.5471 3.1067 3.9472 4.2840 6.1932 4.3612 4.9850 5.2172 1.2605 8.3740 6.4047 4.3614 4.9072 3.0025 5.4265 2.5167 7.4165 3.5506 2.9976 3.2426 6.5472 3.1473 3.1382 4.9094 4.6977 6.9157 6.9377 3.2185 3.7230 4.3072 5.4328 1.1575 7.3024 1.3997 1.2437 1.5184 1.2422 15.0406 1.3260 1.5794 1.8829 1.3863 1.3799 1.3946 5.3612 5.1159 1.4408 1.5963 2.4594 2.5070 2.0169 1.2779 1.2808 1.1411 1.1430 2.3888 2.9908 1.2569 1.2660 1.2659 1.4978 6.3955 5.8692 3.0607 1.1953 2.8601 1.2209 1.6860 1.0997 1.0429 1.0598 2.2583 1.3160 1.1007 6.0878 7.2938 6.0521 7.2222 1.0389 1.0348 1.0602 1.1018 1.0948 1.1002 1.1014 1.1000 1.0889 1.0890 1.0887 1.0889 1.0951 1.0951 1.0965 1.0967
irintensity: 0.6485 0.3448 0.7016 0.0408 0.1203 0.3020 2.2390 0.7807 0.0000 4.9936 0.0444 8.9255 4.6867 0.0606 7.7519 0.6699 8.8926 0.0109 11.5201 0.0028 0.0155 0.0023 76.4796 66.9514 55.2154 0.9664 86.3921 0.0104 0.4504 1.8213 1.2984 6.2020 24.8478 2.1739 84.9850 25.1835 0.0024 38.9210 0.8534 70.1873 0.3593 0.2551 10.1121 0.2428 0.0767 1.2282 4.4543 0.6397 1.7550 27.3851 40.9438 15.3110 15.7186 3.1539 12.2169 20.8315 0.9573 1.6931 5.3923 0.0326 1.6670 3.5428 1.5156 0.0748 3.3307 10.0628 9.0236 12.0352 14.6383 14.2679 16.9444 15.5466 13.4702 22.6680 12.6194 13.6904 6.2733 0.0705 7.9585 0.2252 26.9778 34.1853 35.6606 5.6677 18.6586 57.1296 37.8051 15.4578 12.3885 10.0757 16.1130 6.6123 0.0521 2.8889 13.9638 7.4597
temp: 298.150 k
press: 1.00000 atm
elementType: 16 8 8 6 6 6 6 6 6 6 6 6 6 6 6 6 6 6 1 1 1 1 1 1 1 1 1 1 1 1 1 1 1 1
symmnumber: 1
zpe: 702121.7 jmol-1
zpe.correction: 0.267424 hartree
zpe.thermalcorrener: 0.284737 hartree
zpe.thermalcorrenthalpy: 0.285681 hartree
zpe.thermalcorrgfe: 0.220299 hartree
zpe.sumelectzpe: -1128.242297 hartree
zpe.sumelectthermal: -1128.224984 hartree
zpe.sumelectthermalent: -1128.224040 hartree
zpe.sumelectthermalfe: -1128.289421 hartree
dipole: 0.9699 7.2202 -0.0003
dipole: 7.2851
quadrupole: -88.1810 -131.6891 -107.6747
quadrupole: -7.4492 -0.0010 0.0051
quadrupole: 21.0006 -22.5075 1.5069 -7.4492 -0.0010 0.0051
hfenergy: -1128.5097208 hartree
pointgroup: C01 [X(C15H16O2S1)]
dipole: 0.3325718 -2.846803 0.0013003 debye
polarizability: 240.4834606|5.5601672|156.7480914|-0.0575641|0.0194444|178.7885178 unknown
InChI: InChI=1S/C15H16O2S/c1-3-13-6-10-15(11-7-13)18(16,17)14-8-4-12(2)5-9-14/h4-11H,3H2,1-2H3
charge 0 multiplicity 1
34 atoms
S  -0.491836 1.860908 -0.000666
O  -0.592151 2.629654 -1.445268
O  -0.589507 2.631405 1.443189
C  1.152521 0.91682 -0.001585
C  -1.846524 0.534778 0.001394
C  3.621008 -0.403708 -0.003013
C  1.744443 0.617091 -1.237778
C  1.746866 0.618954 1.233894
C  4.935391 -1.169878 -0.003726
C  2.988018 -0.053257 -1.225217
C  2.990421 -0.051406 1.219899
C  -2.342068 0.094294 1.237519
C  -2.344175 0.092565 -1.233279
C  -3.903683 -1.365149 0.004472
C  -3.375528 -0.869027 1.226222
C  -3.377599 -0.870733 -1.218877
C  4.71418 -2.707018 -0.002866
C  -5.038938 -2.372801 0.006102
H  1.263223 0.929195 -2.170636
H  1.26745 0.932433 2.167222
H  5.532926 -0.892627 -0.892739
H  5.53435 -0.891818 0.884071
H  3.47807 -0.29634 -2.175377
H  3.482341 -0.293062 2.169457
H  -1.949113 0.511398 2.1707
H  -1.952826 0.508373 -2.167712
H  -3.781746 -1.233364 2.176847
H  -3.785439 -1.236398 -2.168299
H  4.14583 -3.024325 0.890007
H  5.681498 -3.241298 -0.003444
H  4.14434 -3.025103 -0.894513
H  -5.008517 -3.021979 -0.886194
H  -5.009099 -3.018448 0.900962
H  -6.019629 -1.858728 0.004734
