program: Gaussian 09
title: 000284210
version: EM64L-G09RevD.01
frameworkgroup: C1[X(C11H18N2O2)]
method: RPBEPBE
basis: SDD
operation: Freq
keyword: #p
keyword: freq=noraman
keyword: PBEPBE/SDD
title: #p freq=noraman PBEPBE/SDD
converged: YES YES NO NO
title: Mulliken charges:
elementType: O O N N C C C C C C C C C C C H H H H H H H H H H H H H H H H H H
charge: -0.316234 -0.283715 -0.373697 -0.379607 -0.202177 -0.184034 -0.246719 -0.231382 -0.528034 -0.454647 -0.489489 0.207760 0.163323 -0.611678 -0.618333 0.223166 0.279248 0.280767 0.260105 0.252212 0.226648 0.213199 0.222926 0.231732 0.214202 0.329386 0.368770 0.228818 0.279096 0.229225 0.223419 0.267269 0.218474
chargesum: 0.00000
title: Mulliken charges with hydrogens summed into heavy atoms:
elementType: O O N N C C C C C C C C C C C
charge: -0.316234 -0.283715 -0.044311 -0.010837 0.020989 0.095214 0.034049 0.028723 -0.049174 -0.018522 -0.043555 0.207760 0.163323 0.125461 0.090829
polarizability: 1.51288916e+02 8.47283285e-01 1.42644691e+02 1.48803825e+00 3.00658620e+00 1.01377808e+02
1716.lowfreq: -6.6425 -0.0002 0.0004 0.0009 14.6675 15.8198 45.5291 74.5719 85.8628
frequency: 45.4531 74.5465 85.7779 102.1498 105.6401 115.6556 126.7706 148.1988 179.3535 222.3532 255.0859 265.4077 293.7483 323.9686 339.7246 403.3504 421.5080 485.6884 525.4757 591.4267 616.4486 644.7505 717.3700 748.7929 752.4532 777.0873 814.7346 836.6816 846.9446 867.5193 888.7864 907.0809 930.0302 938.9272 962.0164 969.3415 991.8777 1024.0074 1046.2553 1066.3638 1080.3500 1093.4942 1117.7034 1119.0512 1120.7559 1137.9862 1140.0135 1147.8127 1159.5954 1182.6333 1203.9802 1225.4776 1239.5832 1252.2482 1259.0655 1269.9195 1284.6943 1289.8409 1299.6714 1306.9504 1320.1946 1337.1022 1415.0652 1417.0668 1460.3826 1470.4116 1471.4338 1477.1472 1485.7313 1488.0085 1493.1662 1524.5365 1551.8113 1580.2209 1623.3880 2965.0273 2971.6812 2983.2887 2996.2728 3003.1338 3008.3042 3014.3396 3031.4361 3047.3341 3050.1837 3063.9134 3073.7736 3089.8703 3100.6439 3100.8919 3115.4293 3318.1358 3561.0689
redmass: 5.2044 4.2017 3.2431 1.1494 1.0890 3.0775 3.4392 3.0589 3.4915 4.0539 2.4816 4.6392 4.6258 3.3466 3.8245 3.2650 4.0712 2.8042 3.4640 2.7111 1.3934 4.4159 5.5557 4.3596 3.3065 4.3617 1.4690 1.1724 2.5289 2.8591 2.6487 2.9158 3.1208 2.5385 2.2466 1.8469 1.9277 2.5446 1.5382 1.6726 2.5230 2.7324 1.2654 1.2955 1.2969 1.6371 1.3021 1.6311 1.9754 1.6247 1.3004 1.3989 1.3837 1.8063 1.6170 1.5508 1.4445 1.6820 1.4996 1.6237 1.5535 1.7907 1.1821 1.1943 1.2325 1.0818 1.0997 1.0905 1.0464 1.0457 1.0995 1.6094 1.7575 5.6236 4.6066 1.0818 1.0348 1.0349 1.0593 1.0838 1.0651 1.0636 1.0814 1.1017 1.1044 1.1025 1.1048 1.1064 1.0950 1.0935 1.0985 1.0831 1.0774
irintensity: 1.4897 8.3012 3.5006 0.1688 0.3795 3.3623 4.4608 2.2076 1.1876 7.5946 1.3798 5.6400 6.8039 12.0834 24.0793 9.8268 5.8969 4.9475 5.8327 22.0198 77.3028 0.7502 1.8821 1.0621 1.8191 2.2275 3.8525 130.9982 7.1821 3.6176 3.8414 1.7073 3.4264 3.4849 6.4411 6.3490 1.1819 3.1582 2.1253 6.4448 3.6307 1.8596 5.3870 0.5349 0.3347 60.4676 8.8418 48.5867 1.8911 3.7013 0.2184 6.4790 2.0321 26.8808 10.1184 18.2093 18.7373 13.2713 3.2573 4.1295 0.5916 5.6657 28.0945 36.8587 81.4791 4.4472 42.9370 17.1745 13.6979 14.8138 9.1656 149.7982 278.7112 147.8632 146.8916 8.8986 89.4443 70.6682 20.6358 12.0089 67.9292 37.5670 56.6214 40.8265 0.8569 31.1598 54.3018 42.7022 1.7187 16.5905 1.6208 314.3491 18.1793
temp: 298.150 k
press: 1.00000 atm
elementType: 8 8 7 7 6 6 6 6 6 6 6 6 6 6 6 1 1 1 1 1 1 1 1 1 1 1 1 1 1 1 1 1 1
symmnumber: 1
zpe: 741684.6 jmol-1
zpe.correction: 0.282493 hartree
zpe.thermalcorrener: 0.297460 hartree
zpe.thermalcorrenthalpy: 0.298404 hartree
zpe.thermalcorrgfe: 0.240281 hartree
zpe.sumelectzpe: -688.782835 hartree
zpe.sumelectthermal: -688.767867 hartree
zpe.sumelectthermalent: -688.766923 hartree
zpe.sumelectthermalfe: -688.825046 hartree
dipole: 5.7738 -0.6588 1.0618
dipole: 5.9075
quadrupole: -88.8272 -88.9412 -89.5785
quadrupole: 5.4214 4.2603 -2.6848
quadrupole: 0.2884 0.1744 -0.4629 5.4214 4.2603 -2.6848
hfenergy: -689.0653276 hartree
pointgroup: C01 [X(C11H18N2O2)]
dipole: 2.2656898 0.066707 -0.5139081 debye
polarizability: 150.8622091|-1.368955|142.5828846|-3.3935347|4.7135197|101.8663206 unknown
InChI: InChI=1S/C11H18N2O2/c1-12-10(14)8-6-3-4-7(5-6)9(8)11(15)13-2/h6-9,12-13H,3-5H2,1-2H3
charge 0 multiplicity 1
33 atoms
O  0.840008 2.126906 0.576629
O  -3.144752 -0.293029 -0.214699
N  2.620677 1.104303 -0.506985
N  -2.03641 1.710681 0.27511
C  0.968031 -1.32526 -1.073601
C  -0.787183 -1.904651 0.271623
C  0.375126 0.056837 -0.649782
C  -0.743892 -0.353802 0.396422
C  -0.35218 -2.143852 -1.202904
C  1.656697 -2.020046 0.14753
C  0.438889 -2.473723 1.039902
C  1.296999 1.162348 -0.130633
C  -2.092323 0.340856 0.120228
C  3.601011 2.133538 -0.135932
C  -3.198679 2.575913 0.059627
H  1.589281 -1.287286 -1.987545
H  -1.762498 -2.3247 0.556308
H  -0.125986 0.491746 -1.540843
H  -0.418811 -0.052651 1.411131
H  -1.062335 -1.725932 -1.936576
H  -0.175864 -3.209675 -1.432081
H  2.338798 -1.341093 0.69029
H  2.253231 -2.886996 -0.189736
H  0.382134 -3.575775 1.099399
H  0.505732 -2.086028 2.072134
H  2.930656 0.301018 -1.055306
H  -1.115384 2.115221 0.520683
H  4.413055 1.707845 0.48168
H  3.071264 2.900945 0.449956
H  4.041805 2.605169 -1.033122
H  -3.459248 3.132901 0.979207
H  -4.050156 1.935186 -0.222676
H  -3.013394 3.305286 -0.751637
