program: Gaussian 09
title: 000284188
version: EM64L-G09RevD.01
frameworkgroup: C1[X(C8H17N)]
method: RPBEPBE
basis: SDD
operation: Freq
keyword: #pfreq=noraman
keyword: PBEPBE/SDD
title: #p freq=noraman PBEPBE/SDD
converged: YES YES NO NO
title: Mulliken charges:
elementType: N C C C C C C C C H H H H H H H H H H H H H H H H H
charge: -0.117822 -0.027053 -0.488238 -0.394267 -0.406284 -0.351161 -0.692832 -0.346334 -0.690462 0.219293 0.230031 0.208952 0.161733 0.218658 0.211542 0.191384 0.207844 0.193034 0.235458 0.201878 0.214138 0.190792 0.192983 0.214738 0.209785 0.212209
chargesum: 0.00000
title: Mulliken charges with hydrogens summed into heavy atoms:
elementType: N C C C C C C C C
charge: -0.117822 0.192240 -0.049256 -0.013876 -0.003357 0.049716 -0.041357 0.037442 -0.053730
polarizability: 1.08302886e+02 -1.08026520e+00 9.56454286e+01 6.27458789e-01 8.01025194e-01 7.60419259e+01
1716.lowfreq: -11.9794 -3.4559 -0.0009 -0.0006 -0.0003 11.5429 44.5232 67.8467 77.6774
frequency: 44.4778 67.7940 77.6398 88.3323 136.3512 173.2491 211.4928 226.4844 288.1311 311.3128 334.0031 399.7879 461.7379 484.5402 700.2615 741.9047 775.9283 799.6653 803.2532 846.9164 901.0100 929.6880 951.0420 988.0506 1013.5356 1035.2886 1064.6823 1082.7764 1084.5360 1101.0780 1109.5052 1126.1726 1158.2311 1178.1982 1216.3067 1237.7663 1264.3508 1269.9481 1282.8318 1286.3217 1311.2985 1341.7042 1367.5542 1380.1926 1389.8859 1396.6870 1455.0692 1464.0550 1469.0533 1472.9870 1476.2489 1476.4648 1480.4732 1485.9518 1489.6139 2860.7941 2963.1695 2972.7755 2974.6596 2975.9865 2980.1670 3003.9900 3008.9758 3025.9046 3042.5241 3044.8642 3052.9285 3070.0792 3071.3414 3072.2698 3082.3544 3159.1610
redmass: 2.2751 1.7854 2.4930 2.5027 2.2416 2.4871 1.2293 1.1161 2.2156 2.6125 2.9653 2.6356 2.8779 2.6151 2.5657 1.0742 3.0703 1.2643 1.1812 2.5095 1.7100 1.2223 1.2123 2.5529 1.3643 2.4901 2.1662 2.2013 1.2781 1.7908 2.0416 1.9004 1.9727 2.0551 1.3955 1.7140 1.2321 1.2811 1.1559 1.1053 1.3782 1.4389 1.4863 1.3276 1.2210 1.7664 1.0774 1.0793 1.0969 1.1153 1.0444 1.0435 1.0806 1.0635 1.0866 1.0698 1.0587 1.0399 1.0409 1.0543 1.0602 1.0931 1.0938 1.0880 1.0955 1.0989 1.0614 1.1006 1.0994 1.0994 1.1005 1.1149
irintensity: 0.2041 0.0100 0.3544 0.4739 0.6427 1.0077 1.2369 0.0549 1.4939 0.8270 3.6920 1.8764 2.0364 0.9373 1.0846 9.2344 16.1195 2.2974 0.3105 7.9496 9.4624 4.2892 8.6878 9.8240 2.0957 2.0701 6.8097 3.5704 11.8225 3.4118 0.2198 6.1602 9.9225 1.7832 0.7385 9.8035 0.7443 2.5289 1.2888 1.9165 10.4327 1.3396 19.9697 12.5869 10.1259 7.2012 6.0036 2.0252 1.3105 1.0500 1.2705 24.1889 4.2426 21.1681 10.6341 85.9318 23.9727 29.3969 15.2046 78.9714 32.4899 21.7044 10.5415 6.0412 5.5403 58.2387 38.9546 63.0571 102.7513 53.7011 50.6289 26.6762
temp: 298.150 k
press: 1.00000 atm
elementType: 7 6 6 6 6 6 6 6 6 1 1 1 1 1 1 1 1 1 1 1 1 1 1 1 1 1
symmnumber: 1
zpe: 616518.0 jmol-1
zpe.correction: 0.234819 hartree
zpe.thermalcorrener: 0.246328 hartree
zpe.thermalcorrenthalpy: 0.247272 hartree
zpe.thermalcorrgfe: 0.196872 hartree
zpe.sumelectzpe: -368.992556 hartree
zpe.sumelectthermal: -368.981048 hartree
zpe.sumelectthermalent: -368.980104 hartree
zpe.sumelectthermalfe: -369.030503 hartree
dipole: -0.1005 -0.2615 1.3760
dipole: 1.4042
quadrupole: -56.5227 -57.3282 -59.4606
quadrupole: 0.5383 0.9438 -0.7917
quadrupole: 1.2478 0.4423 -1.6901 0.5383 0.9438 -0.7917
hfenergy: -369.2273757 hartree
pointgroup: C01 [X(C8H17N1)]
dipole: -0.0319847 0.0363422 -0.550332 debye
dipolederiv: -0.8057778 0.0020376 0.0657932 -0.0220405 -0.1210665 0.0331759 0.1493804 0.0481783 -0.3837541 0.2951704 -0.0802704 0.0264702 -0.0768818 0.0940063 -0.0419945 0.0048799 -0.0957917 0.1832498 0.0969038 0.0518465 0.0662956 0.0283086 -0.0865756 0.0077139 0.0273657 0.009357 0.1923283 0.5449174 -0.0466189 0.0122039 0.0127508 0.1442995 0.0264838 0.0666271 -0.0222742 0.3140753 0.1078457 -0.0145507 -0.0636302 0.0137711 0.0559402 0.0097255 -0.029968 0.0026083 0.1085004 -0.0645971 -0.0677392 0.0059344 -0.0797859 0.030179 0.0143116 -0.084191 0.0426401 0.1230098 0.0224112 -0.0033736 0.0231655 -0.0161262 -0.0512879 0.0284928 -0.0132767 0.0557572 0.0820658 0.0892269 -0.0334933 -0.0157713 -0.0880202 0.0804779 0.0353174 0.0122267 0.0304908 0.1672142 -0.0221821 -0.0752458 0.0092179 -0.0464448 0.009539 0.01821 -0.0145632 0.0130605 0.0874908 -0.003572 0.0370384 -0.111455 0.0302835 0.0150325 -0.0673142 -0.0496355 -0.0662514 -0.1209375 -0.0547994 -0.107884 -0.0727623 -0.0906577 0.0135422 -0.0001436 -0.0939246 -0.0518435 0.0237062 0.0311276 0.0385033 -0.0879995 -0.0064554 -0.0490431 0.0950504 -0.0076317 0.1553016 -0.0493429 -0.0640649 -0.0111027 0.019197 -0.0093343 0.0275988 0.040996 -0.1221462 0.0949014 -0.2508224 -0.0653442 0.0922745 0.0366264 0.1006578 -0.0959994 -0.0599335 0.0388759 -0.0829806 0.0344449 0.0695574 -0.0245789 -0.0399148 -0.0457474 -0.0106091 -0.0860022 -0.0934324 -0.0555164 -0.0874948 -0.1526653 0.0149858 0.1133022 0.0268374 0.0193216 0.0157176 0.142425 0.0220941 -0.0012615 0.064527 -0.0006027 -0.0110536 -0.0014438 0.0571318 0.044535 -0.0020314 0.0583126 -0.1488963 0.0062236 0.0850514 0.0299384 0.0945175 -0.1007138 -0.062724 0.0671639 -0.0852975 0.0232645 -0.0731709 -0.0430856 0.1180947 -0.0101892 0.0886394 -0.0239208 0.1307934 -0.0052584 0.0119419 0.0729332 -0.0579055 -0.063095 -0.0424758 0.0315341 -0.0552694 -0.0670238 -0.1135343 -0.12865 -0.0459112 0.1348984 -0.083573 0.1180855 -0.0784698 0.0739985 -0.0827971 0.0933011 0.0503755 0.0367076 -0.0254938 0.0256062 -0.0079436 0.0410266 0.0607753 -0.0241551 0.0720139 -0.1948101 -0.0121762 0.0614639 0.0251718 0.1001641 -0.1350748 -0.0757453 0.0503586 -0.0986918 0.0338603 -0.2180834 -0.0322436 -0.0742337 -0.0065454 0.0683446 0.0153862 -0.0934014 0.0038217 0.0704711 0.0466897 0.1103574 0.0648731 0.0477118 -0.1040328 -0.0763148 0.0550772 -0.0960176 0.0344636 0.0981028 -0.0042686 -0.018402 -0.0229961 0.0562593 0.0294723 0.0330044 0.0716187 -0.1744929 unknown
polarizability: 108.0035025|2.2355862|95.8819679|0.0481699|-1.4658765|76.1047703 unknown
InChI: InChI=1S/C8H17N/c1-3-5-6-9-7-8(9)4-2/h8H,3-7H2,1-2H3
charge 0 multiplicity 1
26 atoms
N  0.715185 1.005098 0.411176
C  1.742891 0.383741 -0.509034
C  1.75934 1.881538 -0.244745
C  -0.666817 1.133126 -0.133754
C  2.747249 -0.568825 0.120109
C  -1.483873 -0.137159 0.165698
C  2.17564 -1.993419 0.292485
C  -2.943078 -0.043289 -0.333994
C  -3.759727 -1.316838 -0.025268
H  1.373142 0.081041 -1.503656
H  2.508033 2.308259 0.431777
H  1.439346 2.545221 -1.061355
H  -0.674443 1.331695 -1.236007
H  -1.137164 2.005686 0.361155
H  3.043485 -0.164627 1.106528
H  3.661391 -0.599224 -0.507385
H  -1.472302 -0.313145 1.259222
H  -0.986999 -1.012127 -0.300991
H  1.27708 -1.969191 0.934958
H  1.888511 -2.431052 -0.682734
H  2.915005 -2.668891 0.760242
H  -2.949197 0.142975 -1.427922
H  -3.434698 0.834144 0.133797
H  -4.802902 -1.225901 -0.379865
H  -3.312112 -2.202868 -0.513814
H  -3.787684 -1.513764 1.062976
