program: Gaussian 09
title: 000284205
version: EM64L-G09RevD.01
frameworkgroup: C1[X(C9H6ClNO5)]
method: RPBEPBE
basis: SDD
operation: Freq
keyword: #p
keyword: freq=noraman
keyword: PBEPBE/SDD
title: #p freq=noraman PBEPBE/SDD
converged: YES YES NO NO
title: Mulliken charges:
elementType: Cl O O O O O N C C C C C C C C C H H H H H H
charge: 0.017691 -0.122236 -0.202812 -0.143619 -0.366212 -0.205205 0.002648 0.450223 -0.689540 0.392236 -0.415779 -0.303599 -0.217011 -0.231407 0.153566 0.128756 0.314659 0.280764 0.249011 0.245532 0.269018 0.393316
chargesum: 0.00000
title: Mulliken charges with hydrogens summed into heavy atoms:
elementType: Cl O O O O O N C C C C C C C C C
charge: 0.017691 -0.122236 -0.202812 -0.143619 0.027104 -0.205205 0.002648 0.450223 -0.094117 0.392236 -0.166769 -0.303599 0.028521 0.037611 0.153566 0.128756
polarizability: 1.64347867e+02 1.92276724e+00 1.39666942e+02 1.71030728e+01 5.52655122e+00 8.31653058e+01
1716.lowfreq: -5.7730 -0.0009 0.0008 0.0017 0.4648 4.6981 20.4730 29.1198 46.6990
frequency: 20.4380 29.0898 46.6959 49.1839 81.1352 100.8775 174.1492 190.6059 196.3445 236.3030 269.8496 315.6308 353.8137 357.0123 367.4410 418.6138 440.1128 487.6460 521.5568 559.3721 573.3202 607.7469 639.1013 662.3789 679.2456 692.7610 740.7318 778.2252 788.9562 821.5051 872.3466 909.4139 928.5175 983.3741 995.1655 1051.4294 1094.5334 1109.3162 1149.4063 1179.8469 1194.8189 1222.4015 1250.5936 1305.7664 1333.4719 1371.5520 1378.4532 1417.8141 1426.5028 1451.0408 1572.8401 1597.8477 1622.4366 1648.2303 2995.2293 3060.5217 3144.8705 3163.1779 3181.9101 3507.6260
redmass: 8.7608 9.8786 13.0885 10.1986 15.6051 7.0857 10.5044 10.7607 7.4180 6.3742 5.6378 8.3694 6.0927 6.5590 2.5343 7.0187 6.0247 8.5587 5.0620 4.5492 5.4022 1.4426 4.2611 4.6044 3.3431 8.5694 8.3363 1.4460 8.4294 3.8447 4.2870 1.7480 2.1938 1.3528 4.5089 4.4926 2.2275 2.3587 1.7530 1.1669 1.5998 9.8421 1.5632 2.1234 2.2409 9.3194 5.1522 2.6860 1.2303 2.7706 6.6822 7.2651 10.6500 10.0236 1.0642 1.0934 1.0882 1.0927 1.0989 1.0644
irintensity: 0.6220 1.8264 1.2073 2.9324 0.4707 0.2348 1.6990 2.0473 0.5697 1.0234 7.5968 5.1276 4.2413 1.1476 7.8032 4.3280 4.7399 7.3710 12.7267 7.0706 52.5440 89.6720 45.0807 47.3915 36.0692 18.6819 1.5446 51.4641 18.3176 6.1605 14.8623 5.4785 4.6496 0.7698 264.2207 2.0467 58.7991 3.9430 1.7148 1.9163 10.4505 152.8082 10.2290 47.3185 14.1622 6.6984 132.7560 13.0173 22.9165 44.1905 40.1622 22.7005 181.1316 67.0513 21.2724 0.7097 3.5009 6.6515 5.1496 47.4979
temp: 298.150 k
press: 1.00000 atm
elementType: 17 8 8 8 8 8 7 6 6 6 6 6 6 6 6 6 1 1 1 1 1 1
symmnumber: 1
zpe: 366776.8 jmol-1
zpe.correction: 0.139698 hartree
zpe.thermalcorrener: 0.154488 hartree
zpe.thermalcorrenthalpy: 0.155432 hartree
zpe.thermalcorrgfe: 0.094745 hartree
zpe.sumelectzpe: -1236.231310 hartree
zpe.sumelectthermal: -1236.216520 hartree
zpe.sumelectthermalent: -1236.215576 hartree
zpe.sumelectthermalfe: -1236.276263 hartree
dipole: 0.8363 5.3814 0.2759
dipole: 5.4530
quadrupole: -79.7363 -95.5179 -105.6950
quadrupole: -9.6022 -2.0633 -3.2837
quadrupole: 13.9135 -1.8682 -12.0452 -9.6022 -2.0633 -3.2837
hfenergy: -1236.3710079 hartree
pointgroup: C01 [X(C9H6Cl1N1O5)]
dipole: 0.2397305 -2.0359013 -0.6327078 debye
dipolederiv: -0.4091904 0.2690048 0.1167263 0.3412244 -0.2929806 -0.0798469 0.1153105 -0.0673089 -0.0385868 -0.5368319 -0.0059355 0.0812638 -0.0313978 -0.2430422 -0.0790819 -0.1542454 -0.0786573 -0.6130781 -0.4517246 -0.1498314 0.2149178 -0.1741016 -0.5261529 0.1423882 0.2047146 0.0147848 -0.583768 -0.2142133 -0.0239337 0.1038164 -0.0249572 -0.5608038 -0.2023696 0.1431497 -0.1025061 -0.5171026 -0.788873 -0.264962 -0.4829711 -0.2616654 -0.4976449 -0.2008754 -0.4424538 -0.1881493 -0.6869375 -0.7244674 0.0702358 0.2068821 -0.0904452 -0.3893407 -0.1971887 -0.1140485 -0.2263996 -0.7367503 0.4138219 0.2947088 -0.3535797 0.4061126 1.1691668 0.0721005 -0.2905438 0.0959071 0.9737019 0.3242549 -0.0076246 0.0004284 0.0887503 0.1113974 -0.0234699 -0.089085 0.1199017 -0.0398942 -0.3107338 -0.0847268 -0.1194507 -0.0993288 0.0118343 -0.0536777 -0.3663832 -0.0730529 -0.3147293 -0.1022991 -0.0536473 0.0848843 -0.0268671 -0.3404227 -0.0468197 0.1207668 -0.0121799 -0.0093491 -0.2339038 -0.1215369 -0.0413844 -0.2255036 -0.0570901 0.0464957 0.0051657 0.0332301 -0.1173879 0.6158381 -0.2619869 -0.1641745 -0.6287249 0.5500322 0.1741529 -0.2600644 0.0114568 0.0034146 0.1810525 0.0051687 -0.0525089 0.012196 0.1503041 0.0244474 -0.0672712 0.0293269 -0.0961205 -0.0975697 0.1055324 -0.0077938 0.268868 -0.3080056 -0.0639448 0.0295644 -0.0462568 -0.1010981 0.9301418 0.0597242 0.08506 0.2175401 0.2285963 0.1721811 0.5350738 0.1350443 0.7882456 0.9940248 0.1380991 0.1447826 0.2317865 0.4590371 0.4391598 0.3202584 0.4589915 1.0927087 0.0943346 -0.04172 -0.0266512 -0.1082234 0.0975529 0.0450169 0.0545491 0.0192759 0.1359934 0.0560911 0.0257361 -0.0028994 0.060272 0.0100521 -0.0739366 0.0266678 -0.0197661 0.1344454 0.0079036 0.0927454 0.0572581 0.0640781 0.0203632 -0.0244268 0.0436582 -0.0478632 0.1322573 0.0662175 -0.0457521 0.0120655 -0.0528259 -0.0637422 -0.0177982 0.0157913 -0.0200731 0.1514654 -0.0127692 -0.0296819 0.0388123 -0.012126 0.0909353 -0.006191 0.0379694 0.0071329 0.155863 0.1988951 0.0303837 0.1045159 0.045339 0.3799541 -0.0463155 0.1314554 -0.0428387 0.286707 unknown
polarizability: 163.185973|1.9890597|133.5359436|-19.111209|18.767912|90.4581987 unknown
InChI: InChI=1S/C9H6ClNO5/c10-6-3-1-2-5(8(6)11(15)16)4-7(12)9(13)14/h1-3,13H,4H2
charge 0 multiplicity 1
22 atoms
Cl -3.84183 1.141337 0.630906
O  1.519165 0.247637 1.463001
O  -0.150146 2.099811 -1.023028
O  -1.101772 2.3005 1.038135
O  4.215391 0.518574 1.039106
O  3.968871 -0.529961 -1.026096
N  -0.814173 1.629427 -0.014063
C  -0.34216 -0.788665 -0.506932
C  1.103831 -0.49596 -0.853983
C  -1.266492 0.215641 -0.099458
C  -0.801771 -2.124994 -0.556268
C  -2.609397 -0.114236 0.204941
C  -2.136964 -2.457083 -0.241872
C  -3.050002 -1.449513 0.130488
C  1.960161 -0.068419 0.339052
C  3.477852 -0.060708 0.026178
H  1.175894 0.316299 -1.604448
H  1.581397 -1.374981 -1.321786
H  -0.100553 -2.913635 -0.848254
H  -2.471487 -3.49771 -0.292818
H  -4.092754 -1.686732 0.357899
H  5.184641 0.509069 0.807297
