program: Gaussian 09
title: 000284239
version: EM64L-G09RevD.01
frameworkgroup: C1[X(C13H16N6)]
method: RPBEPBE
basis: SDD
operation: Freq
keyword: #pfreq=noraman
keyword: PBEPBE/SDD
title: #p freq=noraman PBEPBE/SDD
converged: YES YES NO NO
title: Mulliken charges:
elementType: N N N N N N C C C C C C C C C C C C C H H H H H H H H H H H H H H H H
charge: -0.312545 -0.095574 -0.174411 -0.633498 -0.614027 -0.012129 0.188425 -0.705445 -0.684198 0.330346 0.229557 -0.354317 -0.342287 -0.022761 0.428000 -0.365083 -0.386656 -0.528637 -0.154748 0.242581 0.226986 0.204815 0.232616 0.236192 0.209297 0.262340 0.260948 0.234098 0.256390 0.334671 0.340025 0.262397 0.270299 0.316010 0.320320
chargesum: 0.00000
title: Mulliken charges with hydrogens summed into heavy atoms:
elementType: N N N N N N C C C C C C C C C C C C C
charge: -0.312545 -0.095574 -0.174411 0.041199 0.022303 -0.012129 0.188425 -0.031063 -0.006093 0.330346 0.229557 -0.091977 -0.081339 -0.022761 0.428000 -0.130984 -0.130266 0.004060 -0.154748
polarizability: 2.75618767e+02 3.15156328e+00 1.39005490e+02 6.75958723e+00 -9.03656783e-01 1.44667388e+02
1716.lowfreq: -12.4650 -6.3125 -0.0004 0.0004 0.0006 4.0922 10.6187 18.2265 41.7013
frequency: -7.5970 18.1182 41.5229 54.4344 81.8419 109.7122 128.7486 164.2458 192.4916 207.3358 220.0471 254.5193 270.4922 303.5588 312.3313 323.6772 338.9807 358.2183 364.0764 375.7031 385.7555 412.9568 427.7063 456.6002 492.6586 492.7801 517.9896 521.6230 529.9790 553.3673 561.9598 616.7537 635.1190 667.3903 685.7812 719.7639 724.2503 795.6895 808.0016 820.4414 852.5006 865.8358 909.0642 926.3655 938.5260 947.9993 950.8899 973.9928 982.9730 988.6482 1011.1764 1050.4508 1104.8776 1112.3714 1120.5124 1129.5852 1186.6719 1191.8052 1196.0291 1209.2483 1242.3596 1274.1031 1280.0805 1303.7588 1364.4636 1367.2599 1385.4394 1403.1382 1407.4116 1438.3676 1448.5204 1448.8460 1459.0922 1469.6221 1475.7287 1500.3172 1531.7018 1569.7384 1573.5234 1604.8529 1615.5235 1619.0796 2205.8321 2979.6233 2979.9061 2997.9506 3029.5358 3079.9865 3093.2636 3100.7529 3109.9483 3121.7881 3136.1226 3156.6489 3161.7458 3553.8385 3568.0688 3708.8156 3730.4101
redmass: 4.3252 5.3367 4.4864 3.7515 5.8275 5.7474 4.1658 3.8346 5.5167 1.1012 4.8331 3.8672 1.0305 2.6694 2.9509 3.3434 3.1191 2.9878 4.3106 1.2358 1.2200 2.8450 3.5736 6.4484 2.7116 2.1908 5.2494 1.1548 1.4283 2.8216 4.5323 4.9866 7.0073 6.3866 5.9830 3.4215 9.8562 4.4738 2.8499 1.9280 1.2445 2.8531 1.5845 2.5004 2.9647 2.1671 3.1515 1.4878 1.3710 1.3332 2.7699 3.5954 1.9503 1.3705 2.1971 2.0496 1.2035 3.2000 2.0892 1.1134 4.0997 3.4026 1.8376 1.4804 1.2336 4.0055 1.2676 4.0825 2.9825 1.0923 2.2388 1.2993 1.1204 1.0694 1.0672 2.6693 2.5909 1.7947 6.8650 2.4240 2.4270 3.7824 12.4713 1.0598 1.0347 1.0354 1.0980 1.1003 1.0999 1.1006 1.0993 1.0896 1.0887 1.0958 1.0964 1.0444 1.0437 1.1053 1.1058
irintensity: 2.1285 5.6700 0.2618 3.1432 1.1514 3.3532 0.5686 2.5347 4.5563 0.0358 1.4918 0.5194 0.4694 8.1703 1.4540 5.6167 3.2320 20.0526 4.2132 135.8196 236.1057 3.1251 21.7932 0.3095 31.5980 31.7890 9.0356 3.0203 62.1545 15.1693 3.6032 5.5864 0.8113 2.2826 6.8297 5.7671 32.2783 0.4694 34.1019 54.4585 0.7222 2.0011 1.5076 0.1154 12.9548 2.2332 5.1422 2.8606 0.8583 1.7602 10.1913 13.4203 3.9792 10.9604 2.6473 42.2683 5.2484 29.7567 2.5959 1.3933 27.3485 92.2220 22.4369 0.5301 32.7003 0.4017 26.3291 390.3486 11.2233 18.0135 95.4573 33.7673 13.6264 8.9382 26.5385 109.2628 274.0445 192.3720 12.4252 640.4733 215.3537 256.0627 9.7465 8.4944 16.4854 18.0081 2.2879 26.8978 13.9248 31.3110 28.9800 14.6658 6.2785 7.2575 1.8035 56.9245 85.4756 52.8033 37.5305
temp: 298.150 k
press: 1.00000 atm
elementType: 7 7 7 7 7 7 6 6 6 6 6 6 6 6 6 6 6 6 6 1 1 1 1 1 1 1 1 1 1 1 1 1 1 1 1
symmnumber: 1
zpe: 730280.2 jmol-1
zpe.correction: 0.278149 hartree
zpe.thermalcorrener: 0.296005 hartree
zpe.thermalcorrenthalpy: 0.296949 hartree
zpe.thermalcorrgfe: 0.232290 hartree
zpe.sumelectzpe: -832.110212 hartree
zpe.sumelectthermal: -832.092357 hartree
zpe.sumelectthermalent: -832.091412 hartree
zpe.sumelectthermalfe: -832.156071 hartree
dipole: -0.6794 1.3538 2.8246
dipole: 3.2051
quadrupole: -128.7581 -107.3884 -110.1988
quadrupole: 4.1679 -16.9915 1.2150
quadrupole: -13.3097 8.0600 5.2497 4.1679 -16.9915 1.2150
hfenergy: -832.3883614 hartree
pointgroup: C01 [X(C13H16N6)]
dipole: -0.2485735 -0.6686232 -1.0398264 debye
polarizability: 274.091716|10.1294444|139.5344966|-12.3673325|-1.4300841|145.6654326 unknown
InChI: InChI=1S/C13H16N6/c1-13(2)18-11(15)17-12(16)19(13)10-5-3-9(4-6-10)7-8-14/h3-6H,7,15-16H2,1-2H3
charge 0 multiplicity 1
35 atoms
N  1.2048 -0.086641 0.042768
N  3.279205 1.189423 -0.431385
N  3.347729 -1.147298 0.32214
N  1.39633 -2.381885 0.636673
N  5.262046 -0.062979 -0.4497
N  -5.983003 -0.713994 1.713018
C  1.892149 1.303721 0.037554
C  1.135771 2.242307 -0.921647
C  1.86969 1.861257 1.488759
C  -0.224358 -0.218135 -0.076472
C  2.009412 -1.180836 0.338985
C  -0.808529 -0.484062 -1.342745
C  -1.068758 -0.091981 1.056498
C  3.908866 0.04745 -0.180712
C  -3.051622 -0.471949 -0.339523
C  -2.205926 -0.607748 -1.470427
C  -2.470162 -0.216561 0.924194
C  -4.56748 -0.587357 -0.540846
C  -5.348753 -0.658263 0.704558
H  1.678449 3.201428 -0.945528
H  1.135597 1.828042 -1.943924
H  0.096746 2.425212 -0.596775
H  2.379901 1.162181 2.175277
H  2.411106 2.822842 1.51172
H  0.835642 2.031826 1.841144
H  -0.154546 -0.591089 -2.214058
H  -0.623669 0.10191 2.038166
H  -2.641278 -0.812293 -2.456606
H  -3.108958 -0.119073 1.809272
H  2.00673 -3.182156 0.780508
H  0.391195 -2.460291 0.763436
H  -4.800146 -1.484988 -1.14619
H  -4.933497 0.281893 -1.123779
H  5.76457 0.745142 -0.804242
H  5.711852 -0.965952 -0.335809
