program: Gaussian 09
title: 000284207
version: EM64L-G09RevD.01
frameworkgroup: C1[X(C14H24O4)]
method: RPBEPBE
basis: SDD
operation: Freq
keyword: #pfreq=noraman
keyword: PBEPBE/SDD
title: #p freq=noraman PBEPBE/SDD
converged: YES YES NO NO
title: Mulliken charges:
elementType: O O O O C C C C C C C C C C C C C C H H H H H H H H H H H H H H H H H H H H H H H H
charge: -0.265280 -0.265251 -0.247773 -0.247795 -0.043665 -0.043716 -0.450936 -0.450924 -0.403403 -0.403399 -0.570379 -0.570396 0.238945 0.238966 -0.261609 -0.261642 -0.665923 -0.665900 0.233590 0.233606 0.195261 0.218861 0.195244 0.218867 0.200612 0.195530 0.200606 0.195535 0.247336 0.228828 0.247386 0.228774 0.223221 0.233653 0.233678 0.223220 0.248624 0.227217 0.217301 0.248602 0.227227 0.217301
chargesum: 0.00000
title: Mulliken charges with hydrogens summed into heavy atoms:
elementType: O O O O C C C C C C C C C C C C C C
charge: -0.265280 -0.265251 -0.247773 -0.247795 0.189925 0.189890 -0.036815 -0.036813 -0.007260 -0.007257 -0.094215 -0.094236 0.238945 0.238966 0.195265 0.195256 0.027219 0.027230
polarizability: 2.03931812e+02 -6.86536820e-03 1.53210776e+02 4.63793933e+00 -2.30516647e-03 1.34368538e+02
1716.lowfreq: -5.6102 0.0009 0.0010 0.0011 5.3115 10.3094 11.6257 13.2180 30.9002
frequency: 10.6067 11.7783 30.8215 33.3430 54.0722 58.8186 80.1696 93.6608 102.5531 123.5257 127.1761 167.8715 174.2918 207.4345 210.3094 277.5034 288.2090 314.9713 320.3800 330.6803 348.0319 374.2787 393.5006 416.2169 426.1098 473.6782 506.7595 533.5934 595.9612 597.2619 664.1739 684.8158 765.5721 784.1060 793.1361 808.5431 813.5988 817.3243 819.6799 868.4475 887.5846 898.9932 903.1466 926.5318 935.3774 978.2805 1012.3738 1014.5976 1054.9798 1058.4942 1071.3475 1073.4525 1084.5253 1093.6351 1096.3335 1107.5769 1115.0785 1137.4008 1150.3698 1156.0280 1156.2166 1200.8133 1201.5874 1228.0728 1245.3261 1270.0834 1276.8443 1278.8466 1278.9042 1290.1978 1300.1743 1324.6924 1332.7076 1334.1575 1342.5922 1342.7278 1346.2682 1356.1143 1358.1899 1363.7227 1390.0771 1390.1580 1436.6025 1448.9754 1456.5527 1456.6301 1459.3846 1461.0687 1462.5744 1462.5959 1467.1213 1473.7760 1484.7242 1484.8331 1634.5914 1635.3506 2956.7903 2957.9740 2965.3163 2969.0413 2970.7130 2981.5940 2992.1586 2992.1968 2994.5247 2995.7560 3025.7391 3028.2304 3028.5702 3028.7344 3029.5136 3041.9338 3067.0212 3068.1781 3087.2050 3087.2662 3091.7136 3091.7177 3118.0174 3118.0245
redmass: 4.2630 4.2706 4.1457 3.3656 2.9985 3.8695 2.7411 3.8206 3.0827 4.2171 4.7284 4.7747 2.0763 1.2584 1.2586 2.3784 2.1180 1.6655 3.5197 2.1185 2.9950 3.8820 3.2393 3.5294 2.7593 2.8230 3.6448 2.2557 3.3964 2.6553 4.3730 3.8803 2.4638 2.3527 2.0544 1.7190 1.4840 1.5580 2.3767 1.5035 2.5283 3.2325 2.7857 1.8886 1.6909 2.0195 2.8793 2.9015 3.1482 2.0197 1.7487 1.4100 2.1513 2.1987 2.1051 2.3043 2.3365 2.1374 2.9756 1.6744 1.7118 1.5656 1.4025 1.5095 1.3608 1.2224 1.2721 1.1195 1.1260 1.2450 1.2978 1.3183 1.4043 1.3922 1.5703 1.4007 1.5500 1.3313 1.3458 1.5215 1.2348 1.2347 1.0948 1.0892 1.0953 1.0959 1.0888 1.0911 1.0430 1.0431 1.0820 1.0976 1.0512 1.0513 9.0249 8.9798 1.0655 1.0680 1.0762 1.0593 1.0655 1.0817 1.0360 1.0360 1.0618 1.0595 1.0974 1.0870 1.0594 1.0666 1.1016 1.1037 1.0985 1.0984 1.0974 1.0974 1.1030 1.1030 1.1061 1.1061
irintensity: 1.7702 0.3395 0.8895 0.4865 0.1979 1.6317 0.2516 1.0716 0.0496 0.3710 5.8071 0.3960 1.1529 7.3605 1.6013 10.9920 1.4998 0.0235 9.5651 0.2105 8.5363 11.2797 5.3061 0.0874 1.3987 1.0233 5.8406 1.2210 2.1515 9.3897 0.4687 16.1847 0.9578 9.3529 2.9518 0.4493 4.3910 0.1695 2.1961 11.9416 3.1679 20.6951 16.3482 32.5664 5.0054 0.9627 14.7925 133.5112 0.8257 21.9544 1.1606 104.3184 27.9804 134.1152 6.9453 195.0292 0.0121 46.5678 40.5493 20.8102 9.6403 152.3228 0.2665 8.9699 30.7583 0.6634 68.7751 2.7903 13.8979 16.4381 1.5902 5.2657 70.3101 0.1163 1.6521 3.9063 1.7905 0.1684 20.9463 6.9417 17.4599 28.4241 8.5161 25.9409 16.5584 7.4191 1.8569 9.5122 9.8174 18.5784 13.2313 4.7078 22.7468 2.2253 269.7350 8.2177 35.8420 0.7544 0.0314 30.4318 38.5169 43.9892 13.6765 27.5196 1.8782 31.0862 74.9080 16.8460 43.5140 46.7908 16.0787 85.0910 4.6939 29.2352 64.7554 8.5886 0.8243 0.7909 4.9191 62.6904
temp: 298.150 k
press: 1.00000 atm
elementType: 8 8 8 8 6 6 6 6 6 6 6 6 6 6 6 6 6 6 1 1 1 1 1 1 1 1 1 1 1 1 1 1 1 1 1 1 1 1 1 1 1 1
symmnumber: 1
zpe: 947324.3 jmol-1
zpe.correction: 0.360817 hartree
zpe.thermalcorrener: 0.381312 hartree
zpe.thermalcorrenthalpy: 0.382256 hartree
zpe.thermalcorrgfe: 0.306938 hartree
zpe.sumelectzpe: -847.363162 hartree
zpe.sumelectthermal: -847.342666 hartree
zpe.sumelectthermalent: -847.341722 hartree
zpe.sumelectthermalfe: -847.417040 hartree
dipole: -0.0016 -0.7593 -0.0004
dipole: 0.7593
quadrupole: -89.2510 -104.1704 -119.4395
quadrupole: -0.0100 10.4722 0.0042
quadrupole: 15.0360 0.1166 -15.1525 -0.0100 10.4722 0.0042
hfenergy: -847.7239783 hartree
pointgroup: C01 [X(C14H24O4)]
dipole: 0.0008116 -0.298737 -0.0007453 debye
polarizability: 203.7724616|0.0206759|153.2105896|5.7069334|0.0635452|134.5280746 unknown
InChI: InChI=1S/C14H24O4/c1-3-17-13(15)9-11-7-5-6-8-12(11)10-14(16)18-4-2/h11-12H,3-10H2,1-2H3
charge 0 multiplicity 1
42 atoms
O  -3.82528 -0.763436 -0.85668
O  3.825518 -0.764522 0.850554
O  -3.296925 -0.253214 1.359227
O  3.29565 -0.242458 -1.362229
C  -0.754557 0.890204 0.201787
C  0.753375 0.891705 -0.19718
C  -1.449165 2.188945 -0.293138
C  1.447322 2.187809 0.305523
C  -0.746199 3.467087 0.212829
C  0.743744 3.468596 -0.192856
C  -1.510003 -0.351583 -0.346473
C  1.509451 -0.353016 0.343465
C  -2.935517 -0.435734 0.172363
C  2.934747 -0.433567 -0.176562
C  -5.260954 -0.937716 -0.469078
C  5.261542 -0.933205 0.461727
C  -5.52405 -2.370746 0.001666
C  5.528102 -2.363056 -0.016637
H  -0.824516 0.864502 1.310157
H  0.823291 0.87277 -1.305689
H  -1.456712 2.190639 -1.403809
H  -2.506067 2.187453 0.03622
H  1.454815 2.182886 1.416183
H  2.50425 2.188836 -0.023762
H  -1.257895 4.363922 -0.186923
H  -0.826589 3.516602 1.318325
H  1.255046 4.363272 0.212217
H  0.824106 3.524741 -1.298039
H  -1.523299 -0.352761 -1.450593
H  -1.008128 -1.283473 -0.020197
H  1.523256 -0.360718 1.447551
H  1.007791 -1.283139 0.011887
H  -5.809187 -0.697615 -1.394088
H  -5.501861 -0.204806 0.320995
H  5.500471 -0.195526 -0.324503
H  5.809369 -0.69662 1.387886
H  -4.974116 -2.583692 0.933845
H  -5.220112 -3.100397 -0.768711
H  -6.60346 -2.507012 0.200188
H  4.978742 -2.572353 -0.949978
H  5.225854 -3.097527 0.749816
H  6.60785 -2.495678 -0.215787
