program: Gaussian 09
title: 000284163
version: EM64L-G09RevD.01
frameworkgroup: C1[X(C8H7NO5)]
method: RPBEPBE
basis: SDD
operation: Freq
keyword: #pfreq=noraman
keyword: PBEPBE/SDD
title: #p freq=noraman PBEPBE/SDD
converged: YES YES NO NO
title: Mulliken charges:
elementType: O O O O O N C C C C C C C C H H H H H H H
charge: -0.244555 -0.426996 -0.250743 -0.210638 -0.207473 0.019892 0.182232 0.197457 0.404830 -0.437863 -0.306777 -0.348844 0.120243 -0.523900 0.327407 0.269976 0.293373 0.288398 0.221561 0.240787 0.391634
chargesum: 0.00000
title: Mulliken charges with hydrogens summed into heavy atoms:
elementType: O O O O O N C C C C C C C C
charge: -0.244555 -0.035363 -0.250743 -0.210638 -0.207473 0.019892 0.182232 0.197457 0.404830 -0.110456 -0.036801 -0.055471 0.120243 0.226845
polarizability: 1.85947532e+02 2.64407404e+00 1.29392379e+02 1.40447159e+00 4.12537305e+00 5.18577750e+01
1716.lowfreq: -7.4258 -0.0006 -0.0001 0.0007 2.3017 10.2680 52.8014 60.8401 83.8939
frequency: 52.7920 60.8388 83.8866 133.8929 145.3336 151.1793 195.7869 239.3897 283.8515 306.1215 317.3000 345.8947 405.6600 454.8432 489.1631 523.1581 535.5884 591.9126 609.5664 629.7202 667.7509 706.8799 726.1303 743.9541 768.5105 852.9719 875.4064 962.8626 964.2773 995.3074 1000.7363 1090.4210 1112.8642 1121.1803 1149.8668 1158.3623 1216.7968 1242.0877 1254.0317 1310.5593 1361.2318 1399.8096 1406.5787 1437.9528 1454.8558 1471.3038 1473.9495 1570.0286 1610.7935 1636.0873 2993.4985 3109.4919 3142.5465 3172.1367 3191.8190 3195.1627 3529.7496
redmass: 7.8181 10.0659 5.1453 7.4279 4.7377 5.7457 1.4871 4.8663 2.3920 7.3049 6.2019 8.2891 5.2539 4.0078 6.6494 3.9861 4.7744 1.5378 3.8289 4.9642 5.0166 6.2464 6.4076 9.1345 4.5812 1.5620 6.8246 4.3197 1.7428 1.3829 3.7893 1.7947 1.3409 1.5928 1.3547 1.7724 7.0936 3.3875 1.5311 2.5807 8.4520 3.2612 7.2183 1.7100 1.0688 1.0776 2.1441 7.8679 7.5547 8.1031 1.0325 1.0997 1.1060 1.0889 1.0968 1.0927 1.0643
irintensity: 0.7200 0.9101 0.3598 5.4547 2.9167 11.7105 0.2610 1.3046 1.4496 6.1091 3.8074 3.9505 3.2005 7.8255 16.5601 2.5456 4.8352 80.9030 46.5978 57.5783 48.3056 14.5039 4.9158 5.8741 7.3340 40.7582 14.7030 35.0045 41.1811 14.4370 183.9374 108.8460 0.4801 16.9562 58.4728 53.2189 484.5522 138.1044 2.8040 51.0034 121.0859 64.7447 4.8048 4.4754 29.2435 66.0945 49.8260 54.8713 44.5476 376.5619 45.9955 24.1634 8.7103 0.8569 1.8435 11.2127 55.8561
temp: 298.150 k
press: 1.00000 atm
elementType: 8 8 8 8 8 7 6 6 6 6 6 6 6 6 1 1 1 1 1 1 1
symmnumber: 1
zpe: 380614.8 jmol-1
zpe.correction: 0.144969 hartree
zpe.thermalcorrener: 0.157555 hartree
zpe.thermalcorrenthalpy: 0.158499 hartree
zpe.thermalcorrgfe: 0.105392 hartree
zpe.sumelectzpe: -738.808853 hartree
zpe.sumelectthermal: -738.796267 hartree
zpe.sumelectthermalent: -738.795322 hartree
zpe.sumelectthermalfe: -738.848429 hartree
dipole: -5.1432 -0.9004 1.2429
dipole: 5.3673
quadrupole: -95.2334 -71.3828 -80.9533
quadrupole: -5.6710 -7.4970 -1.3157
quadrupole: -12.7103 11.1404 1.5699 -5.6710 -7.4970 -1.3157
hfenergy: -738.9538214 hartree
pointgroup: C01 [X(C8H7N1O5)]
dipole: -1.9740502 0.4717533 -0.5828545 debye
dipolederiv: -1.6636714 0.4828286 -0.2672136 0.4325777 -0.4314799 0.0843961 -0.0989002 -0.0329423 -0.3310352 -0.3011721 0.1541402 0.0044509 0.0129528 -1.1474177 -0.3377448 -0.0509411 -0.3823872 -0.5255081 -1.0221433 -0.088443 0.2222265 -0.2038375 -0.5840475 -0.031092 0.1949517 -0.0628635 -0.4482455 -0.9548083 -0.155533 -0.0762328 -0.2168666 -0.5099969 -0.0706927 -0.0878882 -0.0622833 -0.2522172 -0.632021 0.159954 0.0052208 0.3359364 -0.7773386 -0.0788476 0.0464217 -0.0994767 -0.2434313 2.0167476 -0.1984206 0.0880223 -0.3556042 1.0775875 0.1507735 0.034204 0.1668252 0.2235354 -0.6743453 -0.2792632 -0.0378535 0.1649532 -0.5278363 -0.0065172 0.0473388 -0.1045436 -0.0778541 1.4017669 -0.5321094 0.1795519 -0.4855375 0.5295403 -0.1290051 0.0851008 0.0502754 0.127682 -0.9096629 0.0928407 -0.0527089 0.1828653 -0.2858362 -0.011372 -0.0142655 -0.0520953 0.0276272 0.5758459 0.1288596 0.0519271 0.0762157 -0.0676497 0.0101304 0.0225949 -0.0269426 -0.0446153 -0.6811326 0.1414212 -0.0677756 -0.1802362 0.1169106 0.0366327 -0.1694512 0.1107742 -0.1656662 0.2710508 -0.1117305 0.0262692 -0.3445029 0.2249558 0.0089545 -0.011598 0.0426496 -0.0772839 1.3123296 0.3233364 -0.3327268 0.5047411 1.5847196 0.412021 -0.2399058 0.4284236 0.5203828 0.7820704 -0.1312118 0.1812705 0.1623827 0.1684024 0.0457771 0.3106803 -0.055422 0.3473928 0.155143 0.0348896 0.0000716 0.0050985 0.1066053 -0.0050799 0.0031612 0.000369 0.1653418 0.0823385 0.0375612 0.000953 0.0269706 -0.0131093 -0.0238612 -0.0306086 -0.0120968 0.1596423 0.0835374 -0.0641687 -0.0201183 -0.0207864 0.1029038 -0.0117924 0.0054934 -0.0267782 0.1647468 0.0303192 -0.0453895 0.0040941 -0.1587696 0.0938159 0.0176582 0.0040737 0.0483967 0.0433961 -0.0268859 0.0621378 0.076998 -0.0356554 0.0468292 -0.1197889 -0.048543 -0.0442609 -0.0740801 -0.0084085 0.0709316 -0.0563096 0.1274166 -0.0609801 0.0489735 -0.1036194 0.0503106 0.0924043 0.1631018 -0.0826313 0.0698832 -0.0303143 0.3534219 0.0104768 0.1017004 0.0640681 0.3677851 unknown
polarizability: 185.2937795|-5.3503917|128.2878466|7.2602923|10.7505999|53.6160601 unknown
InChI: InChI=1S/C8H7NO5/c1-14-7-3-2-5(9(12)13)4-6(7)8(10)11/h2-4,10H,1H3
charge 0 multiplicity 1
21 atoms
O  -2.197591 1.834241 -0.042862
O  -1.381225 -2.472302 -0.735061
O  -2.950723 -1.183244 0.37879
O  3.996835 0.552468 0.249275
O  3.240468 -1.552882 -0.209226
N  3.047001 -0.297417 0.028424
C  -0.743828 -0.239886 -0.147298
C  -0.991587 1.166493 0.029795
C  1.658547 0.204151 0.048701
C  0.602985 -0.691304 -0.171606
C  0.104274 2.041575 0.293915
C  1.420724 1.577275 0.310459
C  -1.810291 -1.276833 -0.140035
C  -3.348003 1.346001 -0.832931
H  0.815749 -1.750499 -0.331542
H  -0.127733 3.09895 0.447233
H  2.265174 2.245589 0.496166
H  -3.956061 0.654653 -0.231835
H  -3.000425 0.840275 -1.752621
H  -3.905997 2.259105 -1.088181
H  -2.091194 -3.160008 -0.622757
