program: Gaussian 09
title: 000284171
version: EM64L-G09RevD.01
frameworkgroup: C1[X(C16H32)]
method: RPBEPBE
basis: SDD
operation: Freq
keyword: #p
keyword: freq=noraman
keyword: PBEPBE/SDD
title: #p freq=noraman PBEPBE/SDD
converged: YES YES NO NO
title: Mulliken charges:
elementType: C C C C C C C C C C C C C C C C H H H H H H H H H H H H H H H H H H H H H H H H H H H H H H H H
charge: -0.382398 -0.386541 -0.382191 -0.372247 -0.372138 -0.380214 -0.353584 -0.458341 -0.356489 -0.200958 -0.696753 -0.449738 -0.346958 -0.198679 -0.345968 -0.694284 0.192382 0.192627 0.192678 0.194769 0.192040 0.191822 0.193795 0.189687 0.189260 0.189018 0.194413 0.210037 0.187640 0.187564 0.194765 0.204389 0.194752 0.194600 0.223937 0.209673 0.214789 0.209585 0.191420 0.201901 0.188857 0.204388 0.223611 0.192221 0.195601 0.214982 0.210837 0.209438
chargesum: 0.00000
title: Mulliken charges with hydrogens summed into heavy atoms:
elementType: C C C C C C C C C C C C C C C C
charge: 0.002611 0.000906 0.001672 0.011235 0.006140 0.024236 0.021621 -0.059187 0.032863 0.022979 -0.062706 -0.056417 0.046287 0.024932 0.041854 -0.059026
polarizability: 2.52343365e+02 -3.35965694e+00 1.45596528e+02 -7.94608306e+00 -1.35864031e+00 1.44044579e+02
1716.lowfreq: -26.2163 -0.0018 0.0008 0.0024 1.9787 3.1754 10.1106 16.3157 25.6947
frequency: -9.0788 14.6850 25.2307 30.8685 50.9589 57.7648 62.3319 75.1574 80.9733 104.6014 113.7730 115.9451 122.0148 144.5335 145.8683 174.6832 188.5460 226.0433 230.7223 233.9811 282.4992 286.4625 316.2194 379.6156 384.0465 446.8737 472.6984 504.8257 538.0285 716.5803 719.2107 725.5843 726.6758 743.2107 760.6011 783.5657 805.2597 839.8053 886.2310 887.6158 898.4904 916.7331 953.5368 972.4894 977.4981 988.0831 1001.1627 1005.9359 1017.2996 1024.2689 1049.9716 1055.6915 1067.7370 1069.7988 1074.1373 1079.5993 1082.1098 1099.8492 1108.7965 1121.5119 1164.0621 1182.2474 1199.8163 1204.3327 1211.1984 1233.7010 1235.7387 1244.9780 1260.4655 1262.9372 1267.9249 1274.6817 1278.6684 1283.5454 1284.0652 1290.0219 1290.4304 1292.3642 1297.6826 1303.9622 1318.1603 1333.2102 1342.3435 1347.5414 1349.3266 1352.6809 1353.6398 1387.5362 1388.0376 1455.8551 1457.7793 1458.0199 1459.2241 1461.8522 1463.3233 1465.8040 1468.3898 1474.3300 1476.1491 1476.9640 1477.0325 1479.9713 1484.6133 1486.5637 1487.6480 1684.4981 2946.5556 2947.8486 2948.0415 2948.4789 2950.3601 2950.8533 2955.1838 2960.3128 2960.7125 2966.0742 2967.7690 2968.9634 2970.7883 2971.6179 2981.3348 2984.9431 2990.9296 2998.8122 2999.2286 3005.8658 3011.4785 3015.2578 3026.8020 3036.8804 3037.9100 3043.5516 3058.1410 3067.7505 3067.8107 3069.4834 3069.5583 3070.3455
redmass: 2.4241 3.1935 2.5396 3.0771 3.3944 2.9785 1.6815 2.6595 2.1701 2.1990 1.8865 2.4495 3.0267 1.9714 2.0700 3.6010 2.4158 2.8843 1.1553 1.1061 2.9017 2.2885 3.0867 3.7229 2.6539 3.0178 3.1885 3.2130 2.6085 1.0591 1.0695 1.0845 1.0911 1.1613 1.2763 1.1833 1.3601 1.3018 1.7628 1.8785 1.3009 1.3788 1.3181 1.1013 4.5614 2.0356 3.4435 2.5690 1.8097 1.7643 2.8560 2.0224 1.6941 2.3509 2.5292 2.0705 2.2546 2.2630 2.1930 2.6894 2.1581 1.8376 1.3711 1.4385 1.4510 1.3186 1.3419 1.2940 1.2874 1.2308 1.2218 1.0620 1.1292 1.0606 1.1065 1.2405 1.1239 1.1251 1.2127 1.2894 1.3794 1.4226 1.5059 1.5884 1.6424 1.6738 1.6481 1.2168 1.2148 1.0832 1.0829 1.0751 1.0749 1.0647 1.0776 1.0730 1.0851 1.0858 1.0717 1.0429 1.0427 1.0882 1.0922 1.0789 1.0883 6.6495 1.0609 1.0593 1.0604 1.0596 1.0594 1.0592 1.0594 1.0590 1.0592 1.0601 1.0586 1.0608 1.0366 1.0363 1.0962 1.0973 1.0990 1.0959 1.0996 1.0997 1.0995 1.1035 1.1045 1.1043 1.1031 1.1039 1.0942 1.0994 1.0938 1.0960 1.0993 1.0993
irintensity: 0.0022 0.0100 0.0055 0.0388 0.0770 0.0046 0.0086 0.0086 0.0036 0.0609 0.0426 0.0666 0.0807 0.0029 0.0050 0.0270 0.0527 0.6133 0.0409 0.0010 0.4855 1.1758 0.2597 0.1030 0.3856 1.5053 0.0640 1.9450 0.0291 17.2149 0.7487 4.7176 8.9696 0.1198 0.8434 1.5245 0.7779 0.6339 1.1043 7.8873 2.0107 5.1819 0.4216 54.4235 2.1774 1.2258 1.4269 0.8398 0.6403 1.5533 1.1100 1.7700 14.2275 2.1914 0.9866 0.0076 1.2968 9.6599 0.9196 13.1657 0.7672 0.2288 8.2317 4.6691 0.9333 0.0831 0.1104 0.4400 0.3282 0.1892 0.2870 0.0255 0.2410 0.3499 0.3142 0.6927 0.1293 0.2657 0.0693 1.0668 0.1761 0.3202 1.5692 0.2503 0.3814 0.1932 0.3978 11.2438 11.3713 2.4771 2.0376 0.1207 0.4621 0.0415 0.4745 0.5984 0.5380 2.2214 5.2767 12.0283 12.4890 1.7983 8.0731 16.5073 31.2065 0.0009 16.9057 10.2933 13.1392 0.0329 4.4866 3.0312 0.0519 0.5440 28.3778 33.3570 221.3069 111.9960 38.8859 45.9840 0.3456 0.8636 1.2426 7.8751 0.6719 2.8495 0.7312 0.1781 2.7060 12.7284 54.1225 249.3107 1.1180 78.8622 31.4475 177.7759 54.5421 55.7796
temp: 298.150 k
press: 1.00000 atm
elementType: 6 6 6 6 6 6 6 6 6 6 6 6 6 6 6 6 1 1 1 1 1 1 1 1 1 1 1 1 1 1 1 1 1 1 1 1 1 1 1 1 1 1 1 1 1 1 1 1
symmnumber: 1
zpe: 1156621.1 jmol-1
zpe.correction: 0.440534 hartree
zpe.thermalcorrener: 0.461853 hartree
zpe.thermalcorrenthalpy: 0.462797 hartree
zpe.thermalcorrgfe: 0.386748 hartree
zpe.sumelectzpe: -627.544230 hartree
zpe.sumelectthermal: -627.522911 hartree
zpe.sumelectthermalent: -627.521966 hartree
zpe.sumelectthermalfe: -627.598016 hartree
dipole: -0.0173 0.0052 -0.0018
dipole: 0.0181
quadrupole: -105.9491 -106.5436 -102.0178
quadrupole: -1.9055 -0.7045 -0.4162
quadrupole: -1.1123 -1.7068 2.8190 -1.9055 -0.7045 -0.4162
hfenergy: -627.9847638 hartree
pointgroup: C01 [X(C16H32)]
dipole: -0.0068201 0.0007616 -0.0019543 debye
polarizability: 251.6939101|-11.5386257|143.8392483|-3.3977561|0.0106021|146.4513136 unknown
InChI: InChI=1S/C16H32/c1-3-5-7-9-11-13-15-16-14-12-10-8-6-4-2/h9,11H,3-8,10,12-16H2,1-2H3
charge 0 multiplicity 1
48 atoms
C  -3.161917 0.275059 -0.407531
C  -1.837766 -0.041911 0.323869
C  -4.419813 -0.129035 0.394205
C  -0.583473 0.361891 -0.483493
C  -5.741644 0.191647 -0.339853
C  0.74271 0.050312 0.245751
C  -7.002026 -0.213059 0.457716
C  1.993535 0.456506 -0.579737
C  -8.322548 0.112986 -0.277258
C  3.295789 0.211932 0.153413
C  -9.577041 -0.296211 0.524948
C  5.604555 -0.839631 0.455235
C  6.852194 -0.428087 -0.372541
C  4.300949 -0.595937 -0.276032
C  8.182634 -0.74325 0.348792
C  9.423676 -0.329433 -0.471415
H  -3.204503 1.361694 -0.631805
H  -3.170985 -0.244401 -1.388709
H  -1.826702 0.479464 1.303941
H  -1.794573 -1.127969 0.549778
H  -4.378961 -1.215984 0.616951
H  -4.411151 0.389211 1.375995
H  -0.594065 -0.161238 -1.462684
H  -0.62849 1.44777 -0.711876
H  -5.748955 -0.325033 -1.322561
H  -5.782295 1.279008 -0.561156
H  0.760144 0.580014 1.220909
H  0.798039 -1.032298 0.477597
H  -6.965177 -1.301042 0.67644
H  -6.995619 0.301296 1.441642
H  1.904673 1.535336 -0.832256
H  1.99615 -0.094453 -1.541307
H  -8.327412 -0.399515 -1.260983
H  -8.358899 1.200375 -0.493777
H  3.412657 0.733985 1.118001
H  -9.582091 -1.384699 0.723897
H  -10.506842 -0.04788 -0.019462
H  -9.608316 0.222235 1.501969
H  5.696766 -1.918833 0.70498
H  5.602537 -0.290794 1.417995
H  6.832779 -0.95207 -1.350821
H  6.797124 0.655911 -0.598089
H  4.183691 -1.117783 -1.240675
H  8.22772 -1.829671 0.569323
H  8.196138 -0.226446 1.330107
H  10.361681 -0.569726 0.06237
H  9.419216 0.758046 -0.675025
H  9.445806 -0.851986 -1.446476
