program: Gaussian 09
title: 000284168
version: EM64L-G09RevD.01
frameworkgroup: C1[X(C13H19NO2)]
method: RPBEPBE
basis: SDD
operation: Freq
keyword: #p
keyword: freq=noraman
keyword: PBEPBE/SDD
title: #p freq=noraman PBEPBE/SDD
converged: YES YES NO NO
title: Mulliken charges:
elementType: O O N C C C C C C C C C C C C C H H H H H H H H H H H H H H H H H H H
charge: -0.252459 -0.259375 -0.312155 -0.053466 -0.192920 -0.727298 -0.708015 0.228057 -0.642033 -0.489883 0.473772 -0.370203 -0.385322 -0.229605 -0.225584 -0.232784 0.228070 0.248374 0.215327 0.238346 0.212763 0.218014 0.218765 0.212475 0.275057 0.223241 0.213285 0.224633 0.239143 0.223620 0.267632 0.233830 0.228805 0.227740 0.230152
chargesum: 0.00000
title: Mulliken charges with hydrogens summed into heavy atoms:
elementType: O O N C C C C C C C C C C C C C
charge: -0.252459 -0.259375 -0.037099 0.174604 0.055454 -0.060861 -0.058760 0.228057 0.019126 -0.027120 0.473772 -0.102571 -0.151492 -0.000800 0.002157 -0.002632
polarizability: 1.86717324e+02 -1.16459936e+01 1.41883617e+02 1.41147002e+01 1.49132499e+01 1.24706535e+02
1716.lowfreq: -20.7719 -11.6276 -5.7836 -0.0006 -0.0005 -0.0003 13.5136 25.3500 33.4457
frequency: 7.9337 24.5064 33.1527 49.9887 73.4608 92.2358 127.3975 156.6757 170.3260 186.8320 199.8301 222.6457 231.4551 266.9559 284.9802 319.7990 338.6810 379.5335 402.6072 411.6276 448.1832 466.1962 506.8584 591.6924 616.4687 640.0779 693.1525 702.5439 713.5287 753.9149 809.6046 816.9226 827.0996 857.8264 871.5134 923.1443 935.4402 950.2941 962.5031 975.6056 982.2292 990.3495 999.1408 1000.4991 1026.1446 1078.0642 1087.1803 1090.4458 1118.9381 1124.7405 1149.5757 1173.3746 1187.0229 1188.5951 1200.1840 1220.5313 1228.3573 1264.1043 1292.3821 1329.1349 1329.6385 1339.1644 1349.3782 1383.8493 1384.8049 1401.6830 1436.1568 1441.4151 1456.6191 1461.3533 1465.3344 1470.1032 1473.4291 1482.4269 1484.1662 1490.1887 1499.1131 1593.8399 1613.8760 1613.9854 2902.1498 2976.3050 2979.8239 2994.8498 3024.8461 3029.8947 3037.1242 3069.2504 3070.8055 3077.0851 3080.0264 3082.1004 3112.1233 3121.2011 3128.3068 3139.9341 3150.6811 3164.8943 3454.6267
redmass: 3.7801 4.1072 4.4421 3.5068 3.3130 2.5755 4.3957 3.6207 2.2274 3.0342 1.0859 1.3287 1.4970 4.2199 2.6502 2.7081 2.8196 2.7345 2.8153 2.9487 3.1374 3.4082 4.2108 4.2176 6.2426 2.2628 2.8093 1.9112 3.3332 2.0890 3.8509 3.5629 3.6098 1.2725 3.5582 1.1826 1.4830 1.6571 1.6658 1.8539 1.4132 5.4543 2.0200 1.3376 2.2102 3.0940 1.9956 1.5719 1.6416 1.5458 3.3544 1.0543 2.1711 1.1258 2.2652 2.8554 1.1621 1.4173 1.3070 1.3171 1.2618 1.3108 1.4000 1.2212 7.7119 1.2102 1.1375 2.1689 1.1509 1.1359 1.0563 1.0552 1.0704 1.0592 2.2721 1.0463 1.0523 6.0856 7.3221 6.7275 1.0521 1.0355 1.0357 1.0841 1.0793 1.0850 1.0584 1.0992 1.0995 1.0995 1.1004 1.0996 1.1076 1.0860 1.0876 1.0922 1.0965 1.1017 1.0734
irintensity: 0.0662 0.0629 0.2552 0.4220 0.5094 5.5311 0.2842 0.9677 3.5788 1.8461 0.0368 2.3287 1.3514 7.9838 14.4516 0.8906 4.1655 5.1682 0.3991 4.7152 3.5706 11.1042 10.0410 19.9987 0.8485 52.8875 66.4986 71.4584 27.3060 65.2319 7.0341 11.8605 2.1001 2.5785 90.8569 5.1574 1.7112 6.4953 4.7191 7.3561 0.4655 0.3237 7.0186 0.4380 5.0850 189.0808 76.7059 13.6893 15.4934 19.6893 34.5158 0.0503 0.8410 0.3902 25.2283 15.7624 7.2689 30.3188 0.4912 2.2789 1.0842 8.8228 3.8121 24.4997 0.2394 18.5220 3.3926 9.1063 12.2731 14.4274 1.8463 5.7686 14.6937 11.3970 9.5795 14.5551 19.6089 3.7928 78.9719 36.2122 88.2817 30.4337 22.6764 12.0264 52.0092 8.8669 29.1521 18.2685 38.2241 54.4605 32.6083 56.4446 5.1121 4.1571 1.6625 17.9346 28.2285 21.0354 0.8247
temp: 298.150 k
press: 1.00000 atm
elementType: 8 8 7 6 6 6 6 6 6 6 6 6 6 6 6 6 1 1 1 1 1 1 1 1 1 1 1 1 1 1 1 1 1 1 1
symmnumber: 1
zpe: 774825.7 jmol-1
zpe.correction: 0.295116 hartree
zpe.thermalcorrener: 0.312492 hartree
zpe.thermalcorrenthalpy: 0.313436 hartree
zpe.thermalcorrgfe: 0.246860 hartree
zpe.sumelectzpe: -710.746328 hartree
zpe.sumelectthermal: -710.728951 hartree
zpe.sumelectthermalent: -710.728007 hartree
zpe.sumelectthermalfe: -710.794583 hartree
dipole: -1.2403 -0.6131 -0.7523
dipole: 1.5749
quadrupole: -90.5049 -91.2122 -98.5102
quadrupole: -3.7163 2.8943 2.3602
quadrupole: 2.9042 2.1969 -5.1011 -3.7163 2.8943 2.3602
hfenergy: -711.0414432 hartree
pointgroup: C01 [X(C13H19N1O2)]
dipole: -0.5197917 0.2656148 0.2077978 debye
polarizability: 175.6709678|6.8419045|152.1511854|-28.9991364|-8.0061241|125.4853223 unknown
InChI: InChI=1S/C13H19NO2/c1-10(2)12(14-3)13(15)16-9-11-7-5-4-6-8-11/h4-8,10,12,14H,9H2,1-3H3
charge 0 multiplicity 1
35 atoms
O  0.129454 1.198246 -0.145836
O  0.983378 -0.76198 -1.08476
N  2.986763 -0.634203 1.079672
C  3.459182 1.32395 -0.406861
C  2.401237 0.571253 0.469688
C  4.022808 0.45808 -1.558118
C  2.909743 2.667239 -0.940843
C  1.127651 0.243258 -0.345468
C  2.176735 -1.257094 2.149454
C  -1.173516 0.987105 -0.889786
C  -2.165243 0.211764 -0.052406
C  -2.19312 -1.206698 -0.100474
C  -3.081491 0.892999 0.788599
C  -3.120086 -1.928619 0.6831
C  -4.008417 0.171667 1.573626
C  -4.029688 -1.24163 1.521664
H  4.285435 1.535935 0.300927
H  2.094891 1.258039 1.280307
H  4.53689 -0.444757 -1.181332
H  3.22462 0.137959 -2.251977
H  4.765147 1.039257 -2.135694
H  2.121751 2.511572 -1.700908
H  2.474935 3.279612 -0.129766
H  3.722282 3.24884 -1.413563
H  3.243102 -1.319107 0.3556
H  2.72472 -2.123435 2.559862
H  1.169932 -1.608375 1.822648
H  2.033834 -0.53171 2.970995
H  -0.937759 0.466544 -1.833824
H  -1.511781 2.016874 -1.083853
H  -1.478862 -1.732601 -0.744136
H  -3.065557 1.989141 0.829365
H  -3.136032 -3.023328 0.638611
H  -4.713097 0.707309 2.21948
H  -4.750444 -1.802409 2.127508
