program: Gaussian 09
title: 000284155
version: EM64L-G09RevD.01
frameworkgroup: C1[X(C10H8O3)]
method: RPBEPBE
basis: SDD
operation: Freq
keyword: #pfreq=noraman
keyword: PBEPBE/SDD
title: #p freq=noraman PBEPBE/SDD
converged: YES YES NO YES
title: Mulliken charges:
elementType: O O O C C C C C C C C C C H H H H H H H H
charge: -0.233110 -0.174711 -0.158610 0.470216 -0.052185 -0.530355 0.171957 -0.406780 -0.384288 0.138880 -0.201033 0.120408 -0.679387 0.214844 0.247356 0.247645 0.276335 0.242909 0.244715 0.229457 0.215737
chargesum: 0.00000
title: Mulliken charges with hydrogens summed into heavy atoms:
elementType: O O O C C C C C C C C C C
charge: -0.233110 -0.174711 -0.158610 0.470216 -0.052185 -0.068155 0.171957 -0.159135 -0.107953 0.138880 0.041876 0.120408 0.010522
polarizability: 1.50301550e+02 5.45642354e+00 1.35013491e+02 6.84948489e+00 2.25348194e+00 5.75061368e+01
1716.lowfreq: -4.4500 -0.0009 -0.0006 -0.0004 7.2991 9.2256 63.9960 73.7880 153.3440
frequency: 63.9824 73.7804 153.3429 160.3688 186.0437 186.6838 236.8564 300.6188 321.6094 365.1636 439.2278 464.4640 519.7650 549.6869 594.2846 608.1027 656.5452 668.3056 707.2130 766.7543 771.0495 784.2531 811.7703 824.4418 880.5641 940.1265 980.6147 1004.0541 1031.9149 1039.9298 1060.2348 1107.5430 1170.5168 1191.3919 1236.2718 1246.1275 1279.1141 1311.2605 1390.5762 1415.0719 1430.7252 1468.2035 1473.0149 1476.7988 1488.1195 1596.0197 1622.4871 1687.0958 1742.6611 2989.2415 3003.7775 3061.7505 3088.9451 3098.8094 3133.9822 3155.3371 3175.2237
redmass: 2.6461 5.8131 4.6022 7.9077 5.3853 1.5737 2.0035 3.8660 6.7462 3.6442 4.9335 5.1574 6.5595 4.8225 10.7300 5.8531 8.2206 4.3732 6.4432 4.2987 6.4105 1.8256 2.7012 1.5713 3.7055 1.3791 3.0332 1.3637 3.6090 2.2820 1.8895 1.6848 1.6464 2.2002 1.4618 3.3281 1.3486 1.4789 1.1955 6.9477 2.8431 1.6126 1.3878 1.0533 1.1311 7.6305 7.8757 12.7470 12.8458 1.0349 1.0605 1.1013 1.1006 1.1014 1.0885 1.0922 1.0985
irintensity: 0.9640 0.0702 0.0814 2.8696 0.0876 1.2111 1.7229 0.4954 6.5978 0.6977 0.0187 6.7065 10.7308 4.9950 5.0073 7.6280 2.3326 19.2235 24.6240 4.2587 192.0672 1.4043 45.9824 38.9231 12.2314 0.3997 13.2354 0.6555 23.1906 41.7517 22.2022 17.5418 22.1614 42.3611 1.0513 101.3125 8.9638 2.8747 10.0077 0.5705 0.5199 15.9044 12.5029 13.7164 21.8024 4.0544 9.6725 469.6324 184.0319 30.7484 24.0335 2.6334 32.6207 29.3475 5.7650 9.1556 7.8239
temp: 298.150 k
press: 1.00000 atm
elementType: 8 8 8 6 6 6 6 6 6 6 6 6 6 1 1 1 1 1 1 1 1
symmnumber: 1
zpe: 407877.7 jmol-1
zpe.correction: 0.155352 hartree
zpe.thermalcorrener: 0.166323 hartree
zpe.thermalcorrenthalpy: 0.167267 hartree
zpe.thermalcorrgfe: 0.118349 hartree
zpe.sumelectzpe: -610.636972 hartree
zpe.sumelectthermal: -610.626002 hartree
zpe.sumelectthermalent: -610.625058 hartree
zpe.sumelectthermalfe: -610.673976 hartree
dipole: -4.4350 5.3157 -0.0965
dipole: 6.9235
quadrupole: -81.3302 -75.9252 -74.9277
quadrupole: 2.5273 -0.5049 -0.7576
quadrupole: -3.9358 1.4692 2.4667 2.5273 -0.5049 -0.7576
hfenergy: -610.7923249 hartree
pointgroup: C01 [X(C10H8O3)]
dipole: 1.8185592 2.0255803 0.0981188 debye
dipolederiv: -1.228429 0.2845666 -0.1179421 0.3162693 -0.8843346 0.0618877 -0.1370073 0.0600056 -0.2416588 -0.6502061 0.2763598 -0.0409039 0.2462021 -0.9982845 0.0676903 -0.0402555 0.0617082 -0.3002342 -1.2146624 0.0597937 -0.1044263 0.0958484 -0.4598251 0.0174931 -0.1197376 0.012302 -0.3172033 0.3593719 -0.1438917 -0.0230909 -0.4504583 0.0811117 -0.0164839 0.0203152 -0.0173241 -0.0109238 -0.1357095 0.070261 0.0057519 -0.1633577 -0.5786385 0.0083696 -0.0064321 0.0280578 -0.0343884 -0.0088666 0.0873317 0.0535947 0.1796895 0.0204317 -0.0086907 0.1995669 -0.0428272 0.028051 -0.4435922 -0.3074005 -0.0422578 -0.1724958 -0.0734708 -0.0226339 -0.0574094 -0.0328487 0.0204713 -0.0222985 0.1124435 0.0333576 0.3202614 -0.0478028 0.0083078 0.0030232 0.0067936 -0.1359188 0.0012967 -0.1959015 0.0348117 -0.04724 -0.1137492 -0.0043361 0.0180906 -0.0245871 -0.1093204 1.5143155 -0.2875249 0.1336073 -0.0242578 1.5103537 -0.0644552 0.1476824 -0.0811479 0.3069505 0.0321968 0.1174142 0.005498 0.0268006 0.1935136 0.0009427 0.0186238 0.0096341 -0.1077215 1.7684767 -0.011251 0.1720046 -0.2425216 1.2476245 -0.0653267 0.1960391 -0.0334303 0.3186381 0.00722 0.0184141 0.0072653 0.0147947 0.0682799 -0.0341539 -0.1401689 0.0091031 0.0364911 -0.0509409 -0.0350611 -0.0696356 -0.1014283 -0.0104822 -0.1087726 -0.0641027 -0.0567563 0.0160029 0.0500495 -0.0304307 0.0534312 0.0149325 0.0005033 0.0921691 0.0186603 0.0541297 0.0095061 -0.0559532 -0.0820672 -0.0285104 -0.0554211 0.0684079 0.0001449 -0.0285995 -0.0075663 0.1377961 0.0194803 0.0684794 -0.0204489 0.032288 0.0701761 0.0068135 -0.0194589 0.0114129 0.1611075 0.0891162 -0.017592 -0.0072783 -0.0126835 -0.0922472 0.0016286 -0.0095419 0.0029324 0.152664 0.0104721 -0.1100248 -0.0805618 -0.0660709 0.029437 -0.0689599 -0.0560974 -0.0269343 0.0304663 -0.1322318 0.1320366 0.0019782 0.1537906 0.0270508 -0.0011437 0.0150274 0.0003535 0.0651712 0.0908944 -0.0059555 0.0337557 -0.0649421 -0.0580554 0.1295093 0.0417825 0.0669892 -0.0259469 unknown
polarizability: 149.8089341|-6.1530739|135.5019207|7.1506176|-0.624117|57.5103232 unknown
InChI: InChI=1S/C10H8O3/c1-2-6-4-3-5-7-8(6)10(12)13-9(7)11/h3-5H,2H2,1H3
charge 0 multiplicity 1
21 atoms
O  -1.71507 -1.632883 -0.059105
O  0.392058 -2.629517 0.242091
O  -3.414369 -0.024481 -0.329248
C  1.411833 0.425111 0.280341
C  0.130511 -0.155279 0.125716
C  2.679373 -0.395616 0.4303
C  -1.034663 0.630532 -0.0464
C  1.448364 1.848578 0.249742
C  -0.989557 2.032278 -0.079044
C  -0.268532 -1.589967 0.122925
C  0.283972 2.635357 0.07306
C  -2.214085 -0.268597 -0.167835
C  3.217536 -0.894304 -0.94067
H  3.454662 0.217176 0.926344
H  2.486422 -1.276656 1.067729
H  2.416368 2.3489 0.370568
H  -1.899708 2.624135 -0.21297
H  0.372349 3.726817 0.058402
H  2.488313 -1.564793 -1.427115
H  4.153391 -1.462149 -0.795421
H  3.426928 -0.049941 -1.62181
