program: Gaussian 09
title: 000284147
version: EM64L-G09RevD.01
frameworkgroup: C1[X(C7H6BrCl)]
method: RPBEPBE
basis: SDD
operation: Freq
keyword: #p
keyword: freq=noraman
keyword: PBEPBE/SDD
title: #p freq=noraman PBEPBE/SDD
converged: NO NO NO NO
title: Mulliken charges:
elementType: Br Cl C C C C C C C H H H H H H
charge: 0.038440 -0.006070 0.463199 -0.340928 -0.386438 -0.798555 -0.142789 -0.186009 -0.097377 0.255074 0.240864 0.231118 0.242590 0.228395 0.258484
chargesum: 0.00000
title: Mulliken charges with hydrogens summed into heavy atoms:
elementType: Br Cl C C C C C C C
charge: 0.038440 -0.006070 0.463199 -0.085854 -0.145574 -0.096452 -0.142789 0.072476 -0.097377
polarizability: 1.41975758e+02 5.70872810e-01 1.07172216e+02 -3.13954346e-01 -2.61285891e-01 4.10885351e+01
1716.lowfreq: -8.4722 -0.0013 0.0001 0.0002 9.1003 11.0589 73.5088 100.4033 150.0664
frequency: 73.1854 100.3879 150.0633 157.7583 212.8393 298.7475 318.3480 377.2707 417.9614 437.8338 540.3554 613.7799 658.1055 693.4933 817.3829 827.2801 883.7773 955.6820 993.8380 1003.1079 1048.7316 1115.4580 1146.2443 1218.9722 1257.8711 1353.6752 1377.3971 1400.6120 1458.0444 1469.9070 1475.9491 1561.9981 1596.1813 2976.5415 3058.2480 3086.9486 3137.1395 3151.2893 3164.9338
redmass: 1.0197 4.8620 21.8458 4.5124 5.4881 4.6795 6.1915 8.7474 3.7837 3.0867 3.9809 6.0016 7.2525 3.6764 1.3419 5.1328 1.3477 1.3450 2.0471 2.4339 1.5471 2.2983 1.4333 2.2064 1.5306 5.4723 3.1786 1.2207 2.7667 1.1000 1.0559 6.1506 6.5261 1.0389 1.0951 1.0998 1.0890 1.0921 1.0964
irintensity: 0.5664 0.0264 0.1544 2.2453 0.4719 0.0783 0.4678 7.0751 0.7441 11.0963 5.9859 13.4150 11.7050 1.5245 41.5927 31.7520 6.6605 0.9209 25.9292 10.5178 18.9773 34.5620 3.7382 6.3960 3.9176 2.7455 8.8701 12.0250 77.9637 25.3825 14.3243 13.8259 7.5726 28.1619 19.3841 16.1748 8.8229 3.8210 5.1043
temp: 298.150 k
press: 1.00000 atm
elementType: 35 17 6 6 6 6 6 6 6 1 1 1 1 1 1
symmnumber: 1
zpe: 278654.2 jmol-1
zpe.correction: 0.106134 hartree
zpe.thermalcorrener: 0.115086 hartree
zpe.thermalcorrenthalpy: 0.116030 hartree
zpe.thermalcorrgfe: 0.070377 hartree
zpe.sumelectzpe: -743.213219 hartree
zpe.sumelectthermal: -743.204267 hartree
zpe.sumelectthermalent: -743.203323 hartree
zpe.sumelectthermalfe: -743.248976 hartree
dipole: -3.5513 -0.4701 0.0544
dipole: 3.5826
quadrupole: -60.6277 -64.4852 -72.0627
quadrupole: -0.9028 -0.1939 -0.0720
quadrupole: 5.0975 1.2400 -6.3375 -0.9028 -0.1939 -0.0720
hfenergy: -743.3193532 hartree
pointgroup: C01 [X(C7H6Br1Cl1)]
dipole: -1.3890701 0.2386397 0.0170278 debye
dipolederiv: -0.3055732 0.2892156 -0.0010098 0.3411361 -0.3543794 0.0008669 -0.0003253 -0.0017457 -0.0109987 -0.6652163 -0.2336889 -0.0030163 -0.2279024 -0.152119 -0.0009785 -0.0046266 -0.0018094 -0.0362209 0.3963205 0.1165211 -0.0160138 0.0592673 0.0455168 -0.0047566 -0.0797671 -0.018061 -0.0191738 -0.3339781 0.1171008 -0.0011116 0.1970369 -0.1124303 -0.0067842 0.0075238 -0.005721 -0.1141292 -0.0972849 -0.0487997 -0.001815 -0.1242955 0.0242543 0.0064532 0.005224 0.0068614 -0.1736429 -0.1308044 -0.0547625 0.0111797 -0.0518909 0.0324869 0.0023989 0.1123833 0.0268687 0.0603347 0.382414 -0.6792174 -0.0012711 -0.582329 0.6010387 0.0034416 0.0043376 0.0041683 -0.0857292 -0.156876 -0.1459009 -0.0006142 0.010055 0.0040586 -0.0051628 0.0061009 -0.0007891 -0.0854515 0.7967273 0.6031466 0.0098917 0.3560652 -0.0197556 0.0018737 0.0069436 0.0016772 -0.0531249 0.0713817 -0.0520281 -0.0035169 -0.0463976 -0.0364578 0.0000446 -0.0059103 -0.0042082 0.1541791 -0.0333958 0.0988776 -0.0034873 0.0879817 0.0035116 -0.0018547 -0.0071657 0.002136 0.1574217 0.0495663 0.0050738 0.0060086 -0.0695081 -0.0672372 -0.1071024 -0.0557335 -0.0976744 0.0563192 -0.0201905 -0.0318576 0.0482699 -0.0394421 0.1059103 0.0277448 0.0968283 0.0348653 -0.0893493 -0.020245 0.0469626 -0.0421572 0.1204005 -0.0313637 0.0836744 -0.0823858 0.0525208 0.0746357 0.0671544 -0.0306432 -0.0013367 -0.0301771 -0.0430341 0.000141 -0.0034273 0.0009111 0.1649302 unknown
polarizability: 139.2264964|-9.4064011|109.9234426|-0.0498625|-0.0152444|41.0865703 unknown
InChI: InChI=1S/C7H6BrCl/c1-5-2-3-7(9)6(8)4-5/h2-4H,1H3
charge 0 multiplicity 1
15 atoms
Br 2.074962 -2.153292 0.00229
Cl 2.82418 1.160948 0.019901
C  -1.654207 -0.118286 -0.015229
C  -0.631712 -1.100269 -0.012821
C  -1.270688 1.248104 -0.01194
C  -3.115251 -0.527586 0.002305
C  0.731104 -0.732344 0.000944
C  0.088962 1.620078 0.001452
C  1.098829 0.632367 0.007852
H  -0.895716 -2.162945 -0.021201
H  -2.038455 2.029904 -0.02027
H  -3.281787 -1.469402 -0.550043
H  -3.471032 -0.688085 1.038905
H  -3.756917 0.24981 -0.448361
H  0.379228 2.6755 0.002515
