program: Gaussian 09
title: 000284151
version: EM64L-G09RevD.01
frameworkgroup: C1[X(C11H14O)]
method: RPBEPBE
basis: SDD
operation: Freq
keyword: #pfreq=noraman
keyword: PBEPBE/SDD
title: #p freq=noraman PBEPBE/SDD
converged: YES YES NO NO
title: Mulliken charges:
elementType: O C C C C C C C C C C C H H H H H H H H H H H H H H
charge: -0.232448 0.161308 0.380572 0.342598 0.345519 -0.582323 -0.594337 -0.832402 -0.825790 -0.840604 0.102919 -0.791658 0.244635 0.280290 0.238377 0.250453 0.229492 0.226988 0.229538 0.231837 0.230161 0.230564 0.241451 0.236836 0.236491 0.259534
chargesum: 0.00000
title: Mulliken charges with hydrogens summed into heavy atoms:
elementType: O C C C C C C C C C C C
charge: -0.232448 0.161308 0.380572 0.342598 0.345519 -0.337688 -0.314047 -0.114081 -0.137428 -0.138428 0.102919 -0.058797
polarizability: 1.69443345e+02 2.83452704e+00 1.36352516e+02 2.89879427e-01 -5.61087009e-02 6.78396271e+01
1716.lowfreq: -9.3411 -0.9188 -0.0009 -0.0008 -0.0007 14.2675 47.6306 60.4010 93.7565
frequency: 47.1204 60.3349 93.7408 143.5234 150.7496 165.6639 167.1815 183.4597 236.1158 287.7757 301.7854 333.0735 345.1666 383.8292 492.0418 498.2887 517.8449 536.3882 540.6708 593.9760 637.3470 708.7969 733.3540 887.0327 889.0784 908.0554 929.7646 966.6026 996.7812 1002.5159 1017.4727 1027.9104 1046.0725 1056.7333 1079.8231 1101.5949 1186.2314 1229.6144 1259.3990 1322.8568 1369.4620 1374.8569 1392.6371 1398.7184 1406.4259 1414.5621 1438.6911 1448.6728 1460.0199 1463.6385 1472.1026 1479.3434 1480.4205 1488.3934 1496.7802 1570.8566 1598.7791 1617.9082 2969.9258 2972.7089 2974.6514 2985.1676 3041.8409 3046.8647 3050.0254 3069.8912 3083.2485 3088.8870 3106.9534 3124.0007 3134.7803 3141.8724
redmass: 1.0364 4.0826 3.0981 2.4395 1.0294 2.4731 1.4547 1.0938 2.6282 2.8071 3.3550 2.9583 2.8886 4.3786 4.0239 3.2455 3.0038 3.6661 4.0133 4.0203 2.8005 3.6937 2.4400 4.1444 1.4083 2.9978 1.3443 1.9137 1.4829 1.4061 1.4452 1.7944 1.5436 1.7227 2.0213 1.8919 5.0450 1.9601 1.3731 6.3229 1.3631 4.3611 1.2612 1.3306 1.2117 2.8376 1.6474 1.0995 1.0633 1.0497 1.0485 1.2227 1.1534 1.2178 1.2019 6.7049 7.3537 6.2392 1.0380 1.0421 1.0383 1.0374 1.0958 1.0946 1.0973 1.0970 1.0983 1.0979 1.0957 1.0992 1.0908 1.0916
irintensity: 0.1186 5.5597 0.0502 1.5886 0.1789 2.9138 1.1145 1.0906 0.0965 1.0213 6.4174 0.6096 0.0682 3.4017 4.2171 0.1817 0.0238 3.0251 0.1512 17.1937 1.2401 1.7642 4.9147 14.1619 12.6005 0.3125 9.1847 17.9353 5.1575 4.4765 20.7431 0.2181 0.3449 4.5565 6.3554 5.1248 47.3354 73.4676 7.3565 164.5089 58.3659 6.0754 1.1245 22.7168 16.8388 19.1327 7.4229 30.4217 3.1890 22.3671 31.8550 3.6576 28.0769 3.4776 4.0145 138.0722 60.1112 9.3254 47.5993 16.0557 28.9269 3.8875 38.5022 3.4334 19.2797 13.8238 22.4480 19.5900 15.5627 19.7931 12.8879 1.4702
temp: 298.150 k
press: 1.00000 atm
elementType: 8 6 6 6 6 6 6 6 6 6 6 6 1 1 1 1 1 1 1 1 1 1 1 1 1 1
symmnumber: 1
zpe: 569595.0 jmol-1
zpe.correction: 0.216947 hartree
zpe.thermalcorrener: 0.229973 hartree
zpe.thermalcorrenthalpy: 0.230917 hartree
zpe.thermalcorrgfe: 0.177619 hartree
zpe.sumelectzpe: -501.916106 hartree
zpe.sumelectthermal: -501.903081 hartree
zpe.sumelectthermalent: -501.902137 hartree
zpe.sumelectthermalfe: -501.955435 hartree
dipole: 3.5492 2.7308 0.0151
dipole: 4.4782
quadrupole: -73.2327 -68.6452 -74.0769
quadrupole: -9.6963 0.1307 0.0212
quadrupole: -1.2477 3.3397 -2.0920 -9.6963 0.1307 0.0212
hfenergy: -502.1330534 hartree
pointgroup: C01 [X(C11H14O1)]
dipole: 1.4169608 1.0470281 -0.0127684 debye
dipolederiv: -0.9946414 -0.1475751 0.0111688 -0.4076977 -0.7428931 0.0065012 0.0098232 0.0016716 -0.3197168 0.4388455 0.0351663 -0.0008619 0.0257289 -0.1159032 0.0004223 0.0331082 0.0001496 -0.0656723 -0.1926044 0.2171583 0.003329 0.3420348 0.2294986 -0.0021349 -0.0016249 -0.0110638 -0.032148 -0.1028193 -0.2761406 -0.0019001 -0.3274734 0.2255711 0.0053431 -0.0054953 0.0122319 -0.0367212 -0.9169963 0.0053743 0.0131121 0.0789061 -0.0453072 -0.0003552 0.0180493 0.0001277 0.0123534 0.1288749 -0.1472854 -0.0051173 0.1252549 -0.0832907 -0.003483 -0.0069866 0.0038578 -0.1825013 0.0306459 0.1952763 -0.0000486 -0.1323086 -0.0876029 0.0047221 -0.004206 -0.0034738 -0.1397575 -0.2213857 -0.0229609 0.001958 -0.1011281 0.0391126 0.0022855 -0.0621532 0.0003649 0.0606221 0.0012641 -0.1272654 -0.0016166 -0.0775414 -0.068162 0.0034134 0.0008389 0.0175938 0.0653862 -0.0201528 0.13317 0.0027569 0.0866275 -0.0758747 -0.0049871 0.0024383 -0.0142174 0.071856 1.8675925 -0.0276334 -0.0293637 0.0199527 0.897095 -0.0002145 -0.0294877 0.0017332 0.1111715 -0.2269961 0.1966237 0.005201 0.3390171 -0.3570159 -0.0061351 0.0054222 -0.0039561 0.0545482 0.0564324 0.0808835 0.0023455 0.1030288 -0.0616589 -0.0040525 0.0026882 -0.005135 0.1364576 0.1110512 -0.062152 0.0001987 -0.0297549 -0.0117683 -0.0003581 -0.0000976 0.0015858 0.1450525 -0.0165808 -0.0196526 -0.0425242 -0.033167 0.0834441 -0.0716629 -0.0974684 -0.0653612 -0.0671853 0.037832 0.0572125 0.0095611 0.1443467 -0.0711733 -0.046889 0.0378088 -0.0364847 0.0904624 0.0149592 -0.0327851 0.0226997 -0.069461 0.0041682 0.1162989 0.0912676 0.1018794 -0.0034659 -0.0207487 -0.0634035 -0.1170982 -0.024012 0.0449594 0.0224051 -0.1288072 -0.0444493 -0.0305207 0.0066162 -0.0681447 0.1084232 -0.0345209 0.0393908 -0.0100692 0.1223355 0.0537959 -0.0587959 -0.0126718 0.1756967 0.014996 0.054482 -0.0513035 -0.0115996 0.0096274 -0.0179837 0.1056875 0.0022277 0.0655675 0.1094462 0.0360598 0.041364 0.012209 0.1227115 -0.0421582 -0.0549562 -0.0151739 0.0639695 -0.1135698 0.0324422 0.0420134 -0.0189128 -0.125669 0.037269 -0.0349149 -0.001141 -0.1709344 0.0069505 -0.0496184 -0.0436554 0.0055782 0.0057616 0.0108608 0.1069288 0.0847158 -0.0293602 0.0777391 -0.013758 0.0388579 0.0767629 0.0454959 0.0917476 -0.0280715 0.0815342 -0.0319337 -0.0814104 -0.0155601 0.039616 -0.0761951 -0.0487124 -0.0905639 -0.0250886 -0.1206795 0.0011282 0.003625 -0.0718801 0.0905177 0.001107 0.0033317 -0.0000217 0.11899 unknown
polarizability: 169.5182961|2.1953984|136.2527576|-1.5445436|0.3573779|67.864435 unknown
InChI: InChI=1S/C11H14O/c1-7-5-11(10(4)12)6-8(2)9(7)3/h5-6H,1-4H3
charge 0 multiplicity 1
26 atoms
O  -3.155299 -1.245254 0.060327
C  1.781191 0.032597 -0.033307
C  1.033341 1.251039 -0.004724
C  1.092081 -1.22132 -0.025253
C  -1.072094 -0.031637 0.026044
C  -0.378308 1.204749 0.024187
C  -0.318729 -1.23273 0.003828
C  3.298605 0.094717 -0.05584
C  1.743144 2.594338 -0.005381
C  1.843747 -2.543746 -0.045352
C  -2.57004 -0.120523 0.052517
C  -3.386577 1.170075 0.067936
H  -0.935533 2.148158 0.045563
H  -0.870648 -2.179402 0.009832
H  3.698033 0.436915 0.919914
H  3.754509 -0.882789 -0.27459
H  3.660694 0.81433 -0.813205
H  2.458079 2.681058 0.834838
H  2.325331 2.749263 -0.934662
H  1.022229 3.425044 0.078806
H  2.446412 -2.660989 -0.966289
H  2.53768 -2.63692 0.811115
H  1.139653 -3.391058 0.00054
H  -3.172796 1.786424 -0.825168
H  -3.14715 1.781879 0.95771
H  -4.457154 0.915682 0.082915
