program: Gaussian 09
title: 000284133
version: EM64L-G09RevD.01
frameworkgroup: C1[X(C10H15ClSi)]
method: RPBEPBE
basis: SDD
operation: Freq
keyword: #p
keyword: freq=noraman
keyword: PBEPBE/SDD
title: #p freq=noraman PBEPBE/SDD
converged: YES YES NO NO
title: Mulliken charges:
elementType: Cl Si C C C C C C C C C C H H H H H H H H H H H H H H H
charge: -0.321002 1.079689 -0.747059 -0.736499 -0.135856 -0.675312 -0.659325 -0.304066 -0.292861 -0.234304 -0.233579 -0.228886 0.245572 0.257630 0.247225 0.235104 0.229189 0.219051 0.232133 0.222225 0.213370 0.241069 0.229486 0.224732 0.230288 0.230006 0.231979
chargesum: 0.00000
title: Mulliken charges with hydrogens summed into heavy atoms:
elementType: Cl Si C C C C C C C C C C
charge: -0.321002 1.079689 -0.243857 -0.254170 -0.135856 0.005061 0.017339 -0.074580 -0.068128 -0.004016 -0.003573 0.003093
polarizability: 1.71075380e+02 -2.49326561e+00 1.24851020e+02 2.52011130e+00 1.35307491e+01 1.13260216e+02
1716.lowfreq: -14.3133 -4.6956 -0.0022 0.0012 0.0013 11.4117 18.7851 46.8290 56.0979
frequency: 10.8350 46.7970 56.0561 80.8798 90.0352 119.2672 138.9587 162.5840 200.1188 219.5983 238.5450 260.4963 275.3533 309.2470 389.5820 406.8445 450.0809 487.5633 605.1383 614.1418 681.8585 702.2731 707.1822 736.5001 746.6183 753.3710 858.7130 926.0705 971.8120 979.3019 984.4492 988.5404 991.8520 998.9515 1000.6165 1020.0433 1023.3764 1033.9858 1079.6058 1104.7610 1175.3019 1198.4113 1233.4860 1236.9726 1251.8697 1258.9932 1311.9198 1367.5017 1393.5077 1397.2526 1420.1527 1430.7229 1446.7847 1472.0114 1484.3453 1485.1633 1485.7865 1487.8678 1578.5299 1598.1278 2974.7430 2976.0138 2978.5632 2997.7898 3035.1954 3046.5442 3067.7436 3069.0152 3075.1375 3081.3571 3116.9550 3119.6142 3132.9345 3145.3012 3162.3098
redmass: 3.8154 2.6113 3.3971 4.0510 3.1322 4.1136 2.5032 1.4877 4.0064 1.3998 1.3800 3.9196 3.7174 3.6697 2.7622 4.4227 5.5684 3.9899 4.0242 6.4332 2.6233 1.9619 2.0194 2.4337 1.4550 1.7392 1.2496 1.3633 1.2179 1.4018 1.3914 4.5015 1.5378 1.4509 1.3274 2.2584 2.9589 2.5035 1.7028 2.8468 1.0563 1.1268 1.2351 1.2516 1.4203 1.3758 1.4205 5.0941 1.1838 1.1811 2.1229 1.0794 1.0882 1.9850 1.0475 1.0404 1.0457 1.0430 5.4857 5.8316 1.0381 1.0452 1.0471 1.0600 1.0982 1.0995 1.0997 1.0998 1.1001 1.1004 1.0860 1.0869 1.0911 1.0959 1.1016
irintensity: 0.2154 0.0281 0.4105 1.0184 1.1372 2.2950 1.9196 0.2466 3.4535 0.2867 0.4265 0.9245 4.0610 3.3604 0.3252 16.4208 44.1897 59.3346 18.3052 0.1571 7.1851 31.0608 78.0876 70.7916 69.6403 14.0087 0.0864 0.0923 5.2912 0.0174 0.1220 3.1617 3.7019 7.9259 0.0354 28.7380 3.4961 32.5316 2.3881 52.8493 0.1496 3.9115 3.5419 1.7954 6.5791 6.1658 6.8179 0.6436 10.2431 9.1177 15.3852 9.3122 26.8114 2.8605 12.9441 8.3172 9.3001 5.6230 0.0454 1.8224 33.2780 43.9717 17.8171 10.3509 4.9754 0.5099 73.8590 9.5824 42.5900 26.6559 4.6158 4.1337 6.4522 42.9377 28.8983
temp: 298.150 k
press: 1.00000 atm
elementType: 17 14 6 6 6 6 6 6 6 6 6 6 1 1 1 1 1 1 1 1 1 1 1 1 1 1 1
symmnumber: 1
zpe: 581061.7 jmol-1
zpe.correction: 0.221315 hartree
zpe.thermalcorrener: 0.235936 hartree
zpe.thermalcorrenthalpy: 0.236880 hartree
zpe.thermalcorrgfe: 0.177342 hartree
zpe.sumelectzpe: -1138.655511 hartree
zpe.sumelectthermal: -1138.640890 hartree
zpe.sumelectthermalent: -1138.639946 hartree
zpe.sumelectthermalfe: -1138.699484 hartree
dipole: -1.2194 2.0614 -2.6276
dipole: 3.5553
quadrupole: -80.5277 -86.5316 -91.3122
quadrupole: 2.9997 -3.9397 8.4369
quadrupole: 5.5961 -0.4078 -5.1884 2.9997 -3.9397 8.4369
hfenergy: -1138.8768257 hartree
pointgroup: C01 [X(C10H15Cl1Si1)]
dipole: -0.3544093 -0.4479883 1.2768271 debye
polarizability: 169.8218819|3.7837654|132.1880341|-8.8882842|6.5994878|107.1767005 unknown
InChI: InChI=1S/C10H15ClSi/c1-3-12(11,4-2)10-8-6-5-7-9-10/h5-9H,3-4H2,1-2H3
charge 0 multiplicity 1
27 atoms
Cl 1.651443 0.799224 -2.433042
Si 1.236257 0.067091 -0.356352
C  1.953191 -1.700165 -0.299945
C  2.134916 1.296788 0.795893
C  -0.648087 0.089254 -0.094386
C  1.841006 -2.358821 1.101145
C  3.673588 1.311681 0.615649
C  -1.44273 -1.047338 -0.41162
C  -1.3024 1.24487 0.415644
C  -2.842812 -1.033174 -0.221223
C  -2.702226 1.263787 0.607676
C  -3.475837 0.123614 0.289692
H  1.43922 -2.318747 -1.060845
H  3.011752 -1.649063 -0.618476
H  1.728358 2.310002 0.610067
H  1.870071 1.041602 1.842733
H  2.262817 -3.380503 1.089475
H  2.393063 -1.78272 1.867513
H  0.789315 -2.435466 1.43379
H  4.141557 2.059567 1.281677
H  4.121752 0.328661 0.852786
H  3.947431 1.565719 -0.424213
H  -0.971213 -1.951654 -0.81637
H  -0.721294 2.14213 0.662071
H  -3.437664 -1.918413 -0.473157
H  -3.187658 2.164548 0.999989
H  -4.561914 0.137326 0.435929
