program: Gaussian 09
title: 000284145
version: EM64L-G09RevD.01
frameworkgroup: C1[X(C12H12O4)]
method: RPBEPBE
basis: SDD
operation: Freq
keyword: #pfreq=noraman
keyword: PBEPBE/SDD
title: #p freq=noraman PBEPBE/SDD
converged: YES YES NO NO
title: Mulliken charges:
elementType: O O O O C C C C C C C C C C C C H H H H H H H H H H H H
charge: -0.412599 -0.414083 -0.212190 -0.214682 0.177917 -0.273848 -0.499736 -0.492049 0.428269 0.133114 0.098521 -0.402102 -0.428420 -0.233386 -0.234902 -0.245436 0.264908 0.254402 0.244847 0.238056 0.243280 0.286928 0.235379 0.388351 0.389706 0.227158 0.224546 0.228049
chargesum: 0.00000
title: Mulliken charges with hydrogens summed into heavy atoms:
elementType: O O O O C C C C C C C C C C C C
charge: -0.024248 -0.024377 -0.212190 -0.214682 0.177917 -0.008940 -0.000486 -0.010712 0.428269 0.133114 0.098521 -0.115173 -0.193041 -0.006228 -0.010356 -0.017387
polarizability: 1.65731889e+02 -9.89868962e-01 1.39687564e+02 9.82532874e+00 -5.29818493e+00 9.17143761e+01
1716.lowfreq: -13.2322 0.0010 0.0010 0.0010 1.0490 7.5484 31.7790 44.2725 59.8502
frequency: 31.6850 44.1558 59.8392 68.5520 95.1184 144.3220 152.3390 171.0440 200.8507 268.3233 286.7860 339.5883 367.0939 404.2377 419.6329 449.5661 497.5871 538.2227 572.8766 591.4562 605.3561 616.4577 634.9135 686.5574 699.6277 704.2689 717.8113 766.6386 788.9161 858.5109 859.6358 884.9075 926.0489 959.7769 973.7903 982.4422 986.7575 992.0384 999.1098 1009.2777 1032.0706 1046.0107 1069.2630 1102.9223 1120.4858 1144.6691 1172.4006 1193.6025 1197.0193 1218.5577 1238.2757 1245.2745 1250.8652 1293.8263 1299.3337 1321.9520 1340.7657 1376.7784 1435.4045 1457.2638 1468.3122 1486.6966 1588.3932 1614.6953 1640.1178 1658.7798 3000.4188 3036.3473 3049.9452 3106.6147 3121.5256 3129.9020 3130.5909 3142.9670 3152.7936 3164.2199 3515.4652 3521.7214
redmass: 8.9048 4.4299 5.2306 13.1586 5.2834 3.3486 4.7595 4.6081 4.7411 3.0070 5.2334 5.4910 6.9083 2.8478 3.8330 5.0289 3.1903 2.4338 2.1015 1.4184 2.1332 6.0903 3.4727 3.7341 5.0296 2.5836 2.4647 1.8054 1.5884 1.2603 2.0896 3.6143 1.3991 2.9789 3.9177 1.3926 4.0384 4.2942 1.3408 3.0038 2.1024 3.3718 1.6354 2.0507 2.1916 1.8131 1.0522 1.1484 1.2316 1.6507 1.4030 1.4015 1.3689 2.3789 1.9425 1.7106 1.8105 7.0642 2.2528 1.0825 1.1187 2.2893 6.0393 5.9067 9.7097 9.4854 1.0841 1.0586 1.0623 1.1072 1.0844 1.0998 1.0949 1.0928 1.0955 1.1012 1.0640 1.0642
irintensity: 0.9926 0.1660 0.1962 1.4282 0.4344 1.1729 1.2347 0.5987 1.2596 2.2442 0.5555 2.7283 1.5581 0.0644 3.4314 4.1829 12.9235 32.6976 40.6977 210.1070 54.3434 3.4597 24.8208 2.8226 8.6151 43.6352 16.7939 65.8696 4.5084 0.6251 1.2878 8.9946 2.2983 6.3788 6.5928 0.5637 9.1089 1.3132 3.3987 253.8166 18.4968 50.8938 13.0320 8.3751 10.1538 69.6655 0.0406 0.2872 6.1557 0.3773 5.9178 0.7766 7.2103 18.2177 11.2269 24.5607 29.1904 0.2074 8.9406 8.2093 8.9076 21.9632 1.1303 10.3922 202.5497 282.5137 9.2059 28.2791 20.6573 16.7862 0.8454 16.1478 9.8727 28.3020 15.7122 23.2526 32.1896 31.6800
temp: 298.150 k
press: 1.00000 atm
elementType: 8 8 8 8 6 6 6 6 6 6 6 6 6 6 6 6 1 1 1 1 1 1 1 1 1 1 1 1
symmnumber: 1
zpe: 564890.8 jmol-1
zpe.correction: 0.215156 hartree
zpe.thermalcorrener: 0.229689 hartree
zpe.thermalcorrenthalpy: 0.230634 hartree
zpe.thermalcorrgfe: 0.172416 hartree
zpe.sumelectzpe: -764.196233 hartree
zpe.sumelectthermal: -764.181699 hartree
zpe.sumelectthermalent: -764.180755 hartree
zpe.sumelectthermalfe: -764.238972 hartree
dipole: 1.9743 1.2445 -0.6332
dipole: 2.4182
quadrupole: -98.8172 -85.1469 -88.8553
quadrupole: -0.3461 5.3850 4.6712
quadrupole: -7.8774 5.7929 2.0845 -0.3461 5.3850 4.6712
hfenergy: -764.4113882 hartree
pointgroup: C01 [X(C12H12O4)]
dipole: 0.7251622 -0.411119 0.4585198 debye
polarizability: 161.703427|-13.2353548|123.4670548|-14.4695434|-21.7415394|111.9633473 unknown
InChI: InChI=1S/C12H12O4/c13-10(14)12(11(15)16)7-6-9(12)8-4-2-1-3-5-8/h1-5,9,13,15H,6-7H2
charge 0 multiplicity 1
28 atoms
O  -0.90485 -1.751633 -1.13927
O  -1.328666 2.495654 -0.047643
O  -1.434144 0.241246 -2.200887
O  -3.448465 1.654899 0.369344
C  -1.530923 0.102708 0.272089
C  -0.221327 0.013205 1.208351
C  -2.217774 -0.932981 1.240914
C  -0.834652 -1.256891 1.889164
C  1.165066 -0.03687 0.590312
C  -1.303591 -0.410822 -1.14321
C  -2.228166 1.454134 0.19997
C  1.565918 0.933726 -0.366647
C  2.101378 -1.020047 0.99754
C  2.869322 0.910218 -0.908614
C  3.409499 -1.037923 0.461511
C  3.797903 -0.074442 -0.496533
H  -0.275653 0.877714 1.898326
H  -2.735257 -1.76776 0.748219
H  -2.919664 -0.420255 1.918152
H  -0.798257 -1.285959 2.989526
H  -0.408675 -2.186132 1.479517
H  0.854644 1.706443 -0.677541
H  1.811974 -1.774944 1.737124
H  -0.70331 -2.032926 -2.072313
H  -1.83108 3.350418 -0.138591
H  3.161217 1.662227 -1.650563
H  4.12201 -1.803212 0.790096
H  4.810322 -0.089292 -0.915641
