program: Gaussian 09
title: 000284127
version: EM64L-G09RevD.01
frameworkgroup: C1[X(C2H5Cl4N4OP3)]
method: RPBEPBE
basis: SDD
operation: Freq
keyword: #p
keyword: freq=noraman
keyword: PBEPBE/SDD
title: #p freq=noraman PBEPBE/SDD
converged: YES YES NO NO
title: Mulliken charges:
elementType: Cl Cl Cl Cl P P P O N N N N C C H H H H H
charge: -0.078271 -0.087040 -0.088151 -0.079457 1.251226 0.695914 0.696467 -0.436985 -0.741117 -0.647043 -0.657415 -0.614269 -0.304687 -0.270489 0.246467 0.252718 0.366910 0.249174 0.246047
chargesum: 0.00000
title: Mulliken charges with hydrogens summed into heavy atoms:
elementType: Cl Cl Cl Cl P P P O N N N N C C
charge: -0.078271 -0.087040 -0.088151 -0.079457 1.251226 0.695914 0.696467 -0.436985 -0.374207 -0.647043 -0.657415 -0.614269 0.194499 0.224732
polarizability: 2.04465596e+02 5.98032635e-01 1.97797792e+02 8.00105174e-03 -4.78883064e-01 1.60381809e+02
1716.lowfreq: -0.0017 -0.0011 0.0016 2.9597 3.6858 6.9743 30.6523 40.6963 43.5048
frequency: 30.6461 40.6427 43.4507 70.5622 91.6072 111.7994 129.0382 130.4121 135.7042 136.7259 177.4600 194.1365 199.0629 215.1512 244.2903 249.4317 256.1696 272.0689 306.6653 411.2440 427.0031 440.8236 450.1693 457.8721 468.3700 589.1422 613.6404 627.3668 633.6342 709.8128 827.3193 859.7816 868.3009 909.6730 952.4932 967.0658 984.4618 1068.3143 1106.5496 1185.5436 1191.1283 1294.6066 1324.2842 1376.2244 1467.1408 1480.1417 2996.2093 3028.9417 3074.3012 3127.4465 3630.8047
redmass: 25.6180 11.1962 8.5443 4.2001 7.3320 28.3331 8.4050 11.4234 16.2498 13.0238 15.7202 12.5511 16.4640 2.3325 16.2076 21.6900 11.6246 10.0459 6.2264 5.6722 30.5512 1.7227 18.5371 18.1518 13.5222 3.2372 10.9851 20.5653 18.0345 7.2821 3.1424 4.7100 12.3408 2.2488 15.1957 3.8964 7.9078 2.3196 2.0124 1.1493 1.2192 1.1982 1.2223 1.3947 1.0871 1.0810 1.0623 1.0628 1.1019 1.1073 1.0791
irintensity: 0.5620 0.2133 0.6230 3.0188 4.0244 0.6291 2.3096 1.4796 3.1583 1.5553 5.7792 0.1611 0.5022 9.0054 1.1870 2.8169 10.4467 6.0196 1.3961 81.5956 1.4679 254.3858 167.9806 142.1950 35.3002 0.4450 12.8997 18.5557 5.1765 66.1437 25.7899 80.3585 16.4804 89.8190 765.3049 394.0939 351.6215 25.9601 42.0734 0.2918 7.5381 87.4584 6.9653 16.3190 5.2203 2.5259 60.4260 33.8698 19.1515 12.4170 81.6796
temp: 298.150 k
press: 1.00000 atm
elementType: 17 17 17 17 15 15 15 8 7 7 7 7 6 6 1 1 1 1 1
symmnumber: 1
zpe: 254713.9 jmol-1
zpe.correction: 0.097015 hartree
zpe.thermalcorrener: 0.114810 hartree
zpe.thermalcorrenthalpy: 0.115754 hartree
zpe.thermalcorrgfe: 0.048614 hartree
zpe.sumelectzpe: -3236.209333 hartree
zpe.sumelectthermal: -3236.191538 hartree
zpe.sumelectthermalent: -3236.190594 hartree
zpe.sumelectthermalfe: -3236.257734 hartree
dipole: 7.6629 0.1486 -2.1721
dipole: 7.9662
quadrupole: -109.6600 -145.8206 -131.9430
quadrupole: 0.3043 -4.9945 0.5247
quadrupole: 19.4812 -16.6794 -2.8018 0.3043 -4.9945 0.5247
hfenergy: -3236.3063483 hartree
pointgroup: C01 [X(C2H5Cl4N4O1P3)]
dipole: 3.0458792 0.2368789 -0.6995558 debye
dipolederiv: -0.3185656 -0.2111289 0.1083697 -0.2434427 -0.6849898 0.3153914 0.1915345 0.3762294 -0.5043887 -0.3673579 -0.189247 -0.2273963 -0.1867108 -0.4309419 -0.2501051 -0.2874908 -0.3275863 -0.6826433 -0.3678812 0.2455853 -0.1554392 0.2689142 -0.6374122 0.2750475 -0.2130158 0.3539284 -0.4988825 -0.2934449 0.157841 0.1488104 0.1648947 -0.4759325 -0.3070909 0.2266581 -0.3664141 -0.7129674 3.2652186 0.0225029 -0.1190469 -0.0951269 1.5860485 0.1104509 0.3908736 0.1706558 1.0240642 1.5824852 0.4974358 0.1992367 0.5738181 2.3920592 0.054995 0.0669544 0.1619073 1.5270781 1.559003 -0.5062799 0.0732283 -0.5697106 2.3948401 0.2416141 -0.1257202 0.1015975 1.5521928 -1.4320325 -0.0632229 -0.1954886 -0.0688912 -0.4215403 -0.0317351 -0.2469593 -0.0388893 -0.5097742 -1.1873841 0.051718 0.122088 0.0471998 -0.6541305 -0.037656 -0.100434 -0.0326078 -0.5911631 -1.5435157 -0.5533975 -0.0923807 -0.4985876 -0.9209158 -0.0301538 -0.0647284 -0.071501 -0.4340248 -1.5332278 0.5641408 0.0522891 0.519668 -0.9467825 -0.1271385 0.0908807 -0.086526 -0.4614237 -0.5470189 -0.016514 -0.0383818 -0.004466 -1.9940639 -0.2743669 0.0033695 -0.2536027 -0.3770295 0.5588536 -0.1016934 0.0040031 -0.2632947 0.2905823 0.0043921 0.3887448 -0.0217961 0.0008637 0.7855031 0.0624239 0.1557539 0.2802542 0.2948285 0.080409 -0.1751758 -0.0028628 0.1779166 -0.1228913 -0.0617886 0.041913 -0.0732372 0.0240359 0.0531684 0.0429456 0.0306962 0.0945595 -0.06049 0.0576698 0.0071014 0.1607649 -0.1065761 -0.0568593 -0.0489248 -0.0278869 0.0496513 0.1343328 0.0184411 0.0011 0.0553579 0.3433585 0.0085467 -0.1244831 0.0216285 0.2413325 -0.0799812 0.0382566 -0.0785546 0.041676 0.0456269 0.0572814 -0.0577182 0.0419341 0.053101 -0.0316052 -0.0127432 -0.0072054 -0.1090802 -0.0980946 -0.0861911 0.0426892 -0.0289041 0.0515376 unknown
polarizability: 204.3580031|0.4617382|197.0464875|1.9525985|5.362669|161.2407067 unknown
InChI: InChI=1S/C2H5Cl4N4OP3/c3-12(4)8-13(5,6)10-14(9-12)7-1-2-11-14/h7H,1-2H2
charge 0 multiplicity 1
19 atoms
Cl -2.120363 -2.973117 1.296162
Cl -2.441871 -2.340797 -2.021629
Cl -2.373703 2.897953 -1.209953
Cl -2.064025 2.493307 2.1438
P  1.069007 0.002987 -0.090618
P  -1.520031 -1.431072 -0.201858
P  -1.488843 1.458403 0.251488
O  2.068678 -0.33463 1.299603
N  2.408231 0.222954 -1.120293
N  0.151756 -1.411497 -0.462352
N  0.187745 1.484739 0.014833
N  -2.372444 -0.006996 0.223814
C  3.710966 -0.117113 -0.508834
C  3.478739 0.076563 1.013954
H  4.491887 0.573112 -0.871151
H  4.005416 -1.158218 -0.740663
H  2.321681 0.473201 -2.102242
H  4.110663 -0.578931 1.630614
H  3.597509 1.133251 1.311227
