program: Gaussian 09
title: 000284118
version: EM64L-G09RevD.01
frameworkgroup: C1[X(C12H9BrN2O2S)]
method: RPBEPBE
basis: SDD
operation: Freq
keyword: #p
keyword: freq=noraman
keyword: PBEPBE/SDD
title: #p freq=noraman PBEPBE/SDD
converged: YES YES NO NO
title: Mulliken charges:
elementType: Br S O O N N C C C C C C C C C C C C H H H H H H H H H
charge: 0.038751 0.332188 -0.205792 -0.192357 0.006038 -0.674821 -0.409045 -0.434374 0.453910 0.520359 -0.070133 -0.294781 -0.203232 -0.228033 -0.410188 -0.195365 -0.267416 -0.193336 0.281928 0.308033 0.255649 0.261254 0.223964 0.234933 0.227233 0.310691 0.323943
chargesum: 0.00000
title: Mulliken charges with hydrogens summed into heavy atoms:
elementType: Br S O O N N C C C C C C C C C C C C
charge: 0.038751 0.332188 -0.205792 -0.192357 0.006038 -0.040187 -0.409045 -0.434374 0.453910 0.520359 0.211795 0.013252 0.052417 0.033220 -0.186224 -0.195365 -0.032483 0.033897
polarizability: 2.79179235e+02 2.38890066e+01 1.96046610e+02 9.65134786e+00 3.45365962e+00 1.25086846e+02
1716.lowfreq: -0.0020 0.0002 0.0010 1.6657 3.6401 6.1499 22.8445 32.0265 51.1722
frequency: 22.8011 31.9927 51.1703 72.0787 89.4346 134.5942 151.0932 158.3512 167.0359 235.4178 251.8180 290.7217 295.9495 318.7036 363.6767 384.5479 408.0190 432.9313 445.4014 452.4575 494.8772 507.5362 519.0313 546.6020 551.2655 564.0348 652.0585 659.2327 665.5306 699.8476 726.2198 734.2501 759.3186 815.7871 827.9365 839.0577 851.5881 924.5585 945.6647 976.8982 982.8367 998.5348 1010.5447 1037.0912 1042.0417 1080.1768 1094.2269 1137.8196 1158.8557 1172.5977 1199.3622 1244.6947 1268.1098 1324.8892 1340.4668 1361.9759 1382.8308 1398.7944 1439.7967 1441.8221 1483.0964 1548.0854 1569.3690 1582.0068 1606.7050 1632.7122 3122.4377 3140.5344 3147.6889 3154.5241 3172.6938 3175.8056 3186.6782 3532.7729 3684.3541
redmass: 7.4411 5.1920 6.9301 9.0030 8.4583 7.3495 5.5088 8.7625 6.9860 8.7483 6.4755 7.6139 5.7517 8.1784 9.0170 5.8991 1.1362 3.6265 3.8003 4.5472 2.3789 1.5243 4.5450 6.0767 4.2109 6.0133 7.7521 6.7074 5.8486 9.9167 6.1195 2.8929 1.4121 9.8796 5.0523 1.3565 1.4805 1.4100 1.3640 1.3234 1.3350 3.2905 4.1868 2.6541 2.0409 2.0165 4.5450 1.3428 1.4434 1.0566 10.3602 1.3548 1.6162 1.9078 3.6382 7.4770 7.1558 7.2849 2.3805 2.5462 3.0278 8.6443 6.3300 6.8297 2.5476 1.6512 1.0868 1.0887 1.0948 1.0881 1.0999 1.0962 1.0925 1.0464 1.1024
irintensity: 0.6078 0.4563 0.1161 0.4931 0.1315 0.2174 0.6510 2.8326 1.3226 1.3688 0.9641 0.7934 15.6278 1.6057 1.0939 0.7054 116.6445 0.5369 16.1567 10.9092 29.2900 113.1734 21.0428 0.8710 1.8840 8.4703 2.9588 1.6218 0.0469 30.3638 4.9112 1.5069 94.7214 25.1088 9.2285 23.0743 4.1794 17.7067 2.2030 0.2283 0.3835 10.1541 83.8539 5.6535 11.3891 12.1006 21.6057 12.3446 6.3741 8.5193 309.2950 5.9316 17.1381 14.2362 22.8985 115.9878 21.2121 1.8787 208.5461 11.8724 76.4657 9.9757 12.1522 1.0245 6.1631 253.7823 8.5248 3.7454 22.8072 5.4573 22.2315 2.5455 8.8979 58.9599 42.1202
temp: 298.150 k
press: 1.00000 atm
elementType: 35 16 8 8 7 7 6 6 6 6 6 6 6 6 6 6 6 6 1 1 1 1 1 1 1 1 1
symmnumber: 1
zpe: 489729.8 jmol-1
zpe.correction: 0.186528 hartree
zpe.thermalcorrener: 0.202923 hartree
zpe.thermalcorrenthalpy: 0.203867 hartree
zpe.thermalcorrgfe: 0.140022 hartree
zpe.sumelectzpe: -1132.797381 hartree
zpe.sumelectthermal: -1132.780986 hartree
zpe.sumelectthermalent: -1132.780042 hartree
zpe.sumelectthermalfe: -1132.843887 hartree
dipole: -3.0931 -5.1848 1.8029
dipole: 6.3008
quadrupole: -117.1934 -135.5792 -109.0700
quadrupole: 3.9185 -5.7354 0.7181
quadrupole: 3.4208 -14.9650 11.5442 3.9185 -5.7354 0.7181
hfenergy: -1132.9839091 hartree
pointgroup: C01 [X(C12H9Br1N2O2S1)]
dipole: 1.7553434 -1.743107 -0.1593911 debye
polarizability: 278.987478|3.9668358|187.5825199|33.1080994|-10.9880137|133.7426939 unknown
InChI: InChI=1S/C12H9BrN2O2S/c13-8-5-6-12(10(7-8)15(16)17)18-11-4-2-1-3-9(11)14/h1-7H,14H2
charge 0 multiplicity 1
27 atoms
Br -4.246821 -3.009497 -0.232708
S  0.596733 1.551477 -0.008648
O  -3.736588 2.267264 -1.056206
O  -1.590315 2.947867 -0.692636
N  -2.505824 2.031437 -0.741437
N  2.414356 -0.032285 -1.967418
C  -0.764223 0.30493 -0.08573
C  2.04057 0.468345 0.410766
C  -2.108167 0.647043 -0.42014
C  2.799505 -0.143387 -0.638882
C  -0.504375 -1.06079 0.20335
C  -3.142576 -0.32286 -0.46558
C  2.448162 0.356727 1.758675
C  -1.516279 -2.035506 0.163234
C  3.963488 -0.887452 -0.272597
C  -2.836556 -1.655575 -0.17413
C  3.601115 -0.380418 2.105051
C  4.350229 -1.002217 1.074861
H  0.513366 -1.359888 0.47037
H  -4.149926 0.008456 -0.72848
H  1.85194 0.851779 2.532726
H  -1.278695 -3.078023 0.392783
H  4.559655 -1.365763 -1.059117
H  3.910583 -0.464093 3.150953
H  5.24942 -1.576742 1.325159
H  2.974465 -0.447825 -2.706082
H  1.635659 0.574098 -2.22054
