program: Gaussian 09
title: 000284104
version: EM64L-G09RevD.01
frameworkgroup: C1[X(C18H17ClO)]
method: RPBEPBE
basis: SDD
operation: Freq
keyword: #p
keyword: freq=noraman
keyword: PBEPBE/SDD
title: #p freq=noraman PBEPBE/SDD
converged: YES YES NO NO
title: Mulliken charges:
elementType: Cl O C C C C C C C C C C C C C C C C C C H H H H H H H H H H H H H H H H H
charge: -0.048247 -0.251335 -0.239791 0.547012 -0.690961 -0.689499 -0.403520 -0.471497 0.486324 -0.397845 -0.390613 -0.276132 -0.312905 0.306141 0.098261 -0.328808 -0.341108 -0.229397 -0.223863 -0.103623 0.211898 0.229533 0.216389 0.210498 0.211723 0.216233 0.229386 0.232626 0.237482 0.223337 0.237811 0.270814 0.206247 0.224232 0.286929 0.256756 0.259511
chargesum: 0.00000
title: Mulliken charges with hydrogens summed into heavy atoms:
elementType: Cl O C C C C C C C C C C C C C C C C C C
charge: -0.048247 -0.251335 -0.027894 0.547012 -0.034541 -0.032156 -0.170894 -0.234015 0.486324 -0.174508 -0.152801 -0.005318 -0.106658 0.306141 0.098261 -0.104576 -0.054179 0.027359 0.035647 -0.103623
polarizability: 4.55222135e+02 2.99817721e+00 2.06966746e+02 -1.29765141e+00 -7.25032750e-01 9.85818084e+01
1716.lowfreq: -24.1435 -7.0180 -3.8198 -0.0014 0.0010 0.0012 2.6669 16.2117 31.0786
frequency: -20.2822 12.7853 30.7214 35.0845 53.7477 82.4752 121.1977 127.7642 147.9661 170.2269 199.8964 214.0684 242.9801 258.3528 270.0278 273.7595 292.7746 313.6195 372.4654 395.6161 405.7154 418.1839 453.8885 473.9300 497.4787 524.6960 540.2321 547.7633 623.1471 635.1510 668.0937 677.7490 723.1573 730.6721 759.8909 797.2271 824.2447 839.5092 841.8445 856.8104 881.1182 888.0299 888.7594 917.3066 954.3425 955.5665 964.7713 976.9655 995.7057 997.5692 1008.0326 1016.4988 1029.7797 1051.8432 1072.7868 1108.4257 1109.1615 1114.6633 1157.0940 1182.0503 1194.3517 1217.4436 1222.7636 1231.5485 1285.8368 1295.7341 1306.2410 1308.2949 1332.4115 1343.4492 1371.1487 1376.5354 1389.1648 1395.5944 1397.4003 1420.2821 1466.8766 1467.9100 1474.5718 1479.7583 1484.1981 1506.2529 1513.3999 1565.7501 1580.2363 1593.7534 1616.5967 1634.6119 2976.0388 2978.4856 2983.6900 3069.4201 3076.3872 3079.5586 3083.4067 3094.8754 3118.4447 3120.9109 3140.1675 3144.9455 3148.2844 3154.8367 3158.0532 3172.7841 3176.9621
redmass: 3.0793 3.9810 3.5737 6.1886 4.9277 7.6226 4.5463 5.1548 2.9411 6.3468 3.4528 1.0639 1.2735 3.0952 4.8690 4.2689 3.8541 5.5232 4.3730 3.1568 2.8419 3.1212 3.4992 3.3212 7.1541 4.3375 3.5571 2.3780 7.1527 6.9582 3.8653 5.1607 4.5878 2.9480 3.2515 6.1413 1.3770 1.4846 1.3140 1.5777 4.1355 1.9703 2.6081 1.1751 1.3859 1.4685 1.3752 1.3830 4.4478 1.3636 2.9679 1.2410 3.3204 1.5798 2.7271 1.4176 2.5338 1.5538 1.7461 1.1532 1.1389 2.6490 1.6208 1.7909 1.3094 1.6055 1.3192 2.4098 1.7117 1.4812 4.5016 1.1935 2.8276 1.4707 3.0172 2.9282 1.0449 1.0506 2.3816 1.0485 1.1143 2.3618 10.1719 6.0960 7.5618 6.1861 6.1801 5.5934 1.0348 1.0353 1.0844 1.1000 1.0991 1.1007 1.0999 1.0892 1.0872 1.0867 1.0962 1.0927 1.0941 1.0886 1.0876 1.0963 1.0971
irintensity: 0.0861 0.0616 0.0059 0.0243 0.0319 3.1425 0.3845 0.8944 0.6434 0.6933 1.0512 0.0241 0.3445 0.2382 1.2970 2.0204 2.3354 4.0549 17.0253 0.1054 0.0370 0.0652 0.7503 11.4164 31.7527 7.3725 7.9551 33.9788 2.7244 0.0905 3.8851 4.7118 12.8160 1.1083 10.7016 25.0765 23.6212 73.1762 28.7714 4.6203 9.6652 1.2350 2.7178 3.0382 1.1327 0.0214 2.2362 0.6174 101.8025 1.0253 5.2070 38.8745 96.0966 54.5834 70.1320 6.7409 1.5139 31.6581 0.4570 81.4756 17.8069 173.1957 52.7809 2.6048 0.1010 11.4835 0.8148 143.0323 41.5051 77.6416 23.2016 15.1129 30.3778 8.2531 22.6240 25.2856 1.4817 5.3454 24.1557 16.8274 4.6169 79.4581 237.8564 27.4728 58.6841 235.6643 99.0410 306.0981 30.4518 41.5745 21.2875 1.1759 114.8118 22.8315 41.6834 0.8851 10.7346 20.4312 28.4216 5.3088 7.3568 0.4761 14.4988 11.2674 4.3384
temp: 298.150 k
press: 1.00000 atm
elementType: 17 8 6 6 6 6 6 6 6 6 6 6 6 6 6 6 6 6 6 6 1 1 1 1 1 1 1 1 1 1 1 1 1 1 1 1 1
symmnumber: 1
zpe: 770842.2 jmol-1
zpe.correction: 0.293598 hartree
zpe.thermalcorrener: 0.311851 hartree
zpe.thermalcorrenthalpy: 0.312795 hartree
zpe.thermalcorrgfe: 0.244542 hartree
zpe.sumelectzpe: -1229.977986 hartree
zpe.sumelectthermal: -1229.959734 hartree
zpe.sumelectthermalent: -1229.958790 hartree
zpe.sumelectthermalfe: -1230.027042 hartree
dipole: 4.4854 -2.5359 0.0040
dipole: 5.1527
quadrupole: -113.5110 -123.5718 -131.1460
quadrupole: -1.2078 -0.3961 -0.2380
quadrupole: 9.2319 -0.8289 -8.4030 -1.2078 -0.3961 -0.2380
hfenergy: -1230.2715846 hartree
pointgroup: C01 [X(C18H17Cl1O1)]
dipole: 1.7866587 0.952243 -0.1032471 debye
polarizability: 454.8611734|-7.7224677|205.139114|7.1427278|-14.9410318|100.7704015 unknown
InChI: InChI=1S/C18H17ClO/c1-13(2)15-6-3-14(4-7-15)5-12-18(20)16-8-10-17(19)11-9-16/h3-13H,1-2H3
charge 0 multiplicity 1
37 atoms
Cl -7.335875 1.849962 -0.308156
O  -2.087602 -2.455519 0.333456
C  6.033135 0.634332 0.054243
C  4.576535 0.170261 0.090227
C  6.322618 1.698115 1.147403
C  6.424396 1.165513 -1.351656
C  3.50501 1.085011 -0.118847
C  4.250163 -1.188851 0.328341
C  1.835948 -0.706591 0.157487
C  2.166709 0.660745 -0.085872
C  2.909305 -1.620509 0.360637
C  0.462856 -1.212706 0.210656
C  -0.703673 -0.503131 0.072022
C  -3.285251 -0.389398 0.032495
C  -2.014011 -1.191915 0.156686
C  -3.322322 1.0235 -0.119107
C  -4.515797 -1.100873 0.078098
C  -4.550966 1.71034 -0.222543
C  -5.750382 -0.43343 -0.024937
C  -5.747444 0.969191 -0.174558
H  6.66953 -0.247801 0.268404
H  6.073164 1.316567 2.153655
H  7.391882 1.979159 1.137617
H  5.731751 2.617338 0.977352
H  5.830588 2.059246 -1.619335
H  7.492243 1.451494 -1.372399
H  6.254469 0.400725 -2.130472
H  3.726652 2.141913 -0.309041
H  5.057267 -1.913633 0.490049
H  1.36837 1.392757 -0.251727
H  2.679981 -2.676763 0.547543
H  0.342788 -2.292692 0.385909
H  -0.682951 0.576853 -0.102674
H  -2.400756 1.611611 -0.153872
H  -4.472372 -2.188145 0.197961
H  -4.578113 2.7976 -0.336787
H  -6.694043 -0.985175 0.01014
