program: Gaussian 09
title: 000028237
version: EM64L-G09RevD.01
frameworkgroup: C1[X(C15H24)]
method: RPBEPBE
basis: SDD
operation: Freq
keyword: #p
keyword: freq=noraman
keyword: PBEPBE/SDD
title: #p freq=noraman PBEPBE/SDD
converged: YES YES NO NO
title: Mulliken charges:
elementType: C C C C C C C C C C C C C C C H H H H H H H H H H H H H H H H H H H H H H H H
charge: 0.438310 -0.190710 -0.498873 -0.567542 -0.495369 -0.114916 -0.497605 0.527442 -0.424802 -0.810977 -0.590293 0.514972 -0.790330 -0.844825 -0.745081 0.187651 0.196921 0.204807 0.216153 0.215276 0.210459 0.194095 0.179577 0.217133 0.207077 0.218897 0.202708 0.210158 0.223248 0.239528 0.216000 0.200693 0.231089 0.215887 0.224805 0.225722 0.225823 0.214037 0.212855
chargesum: 0.00000
title: Mulliken charges with hydrogens summed into heavy atoms:
elementType: C C C C C C C C C C C C C C C
charge: 0.438310 -0.003059 -0.097146 -0.136114 -0.090815 0.064662 -0.073394 0.527442 -0.003197 -0.138042 -0.173600 0.514972 -0.343354 -0.168476 -0.318189
polarizability: 1.73949974e+02 2.50817740e+00 1.49444259e+02 5.95067143e+00 8.76834268e+00 1.38604933e+02
1716.lowfreq: -26.4133 -7.8311 -0.0007 -0.0003 0.0004 14.8709 27.1290 65.7590 116.0981
frequency: -25.7517 65.4907 116.0927 122.7289 138.6895 169.9289 203.4746 211.3034 238.5014 256.4702 278.0687 286.8767 320.4083 340.1300 373.3750 394.7596 417.6733 427.0350 460.7241 480.2410 506.4157 512.9458 552.1827 581.4910 599.3153 683.4973 707.1937 744.5458 787.2741 803.1789 831.6034 853.6698 872.1811 884.2603 906.9139 924.4141 927.4758 932.1142 940.4156 960.0289 966.1677 987.6981 1001.9880 1012.0306 1022.4701 1038.6787 1048.2272 1066.3551 1090.5878 1103.3469 1107.9003 1140.7389 1150.6978 1170.5663 1181.0043 1196.7910 1209.6361 1242.6306 1251.8938 1262.3000 1274.3527 1293.2071 1300.5259 1312.8799 1319.8404 1327.5707 1332.6234 1333.7676 1346.9559 1356.4189 1359.5688 1387.5971 1390.1474 1427.5119 1431.5416 1449.5680 1458.3656 1459.6894 1461.6341 1466.0878 1468.7050 1473.3947 1474.7200 1483.3648 1501.7170 1662.6582 1667.3324 2892.7915 2941.1936 2946.0418 2947.9950 2951.3246 2958.3054 2980.2740 2982.5021 2985.1807 2986.4736 3006.8571 3012.8873 3030.1056 3034.4971 3037.5734 3043.1065 3046.8236 3070.6100 3080.5949 3085.1182 3087.5899 3090.3344 3185.1306 3190.2725
redmass: 2.8435 3.2551 2.8195 2.8285 2.7241 1.1959 2.0234 1.2426 2.9173 2.7001 2.9861 1.8970 2.2064 2.4133 2.4497 2.2818 2.5173 2.6886 2.3497 2.4541 2.4059 2.4626 2.3433 2.4773 2.9172 1.5568 1.1320 1.5120 1.7595 3.1268 2.1044 1.4893 2.6500 2.3706 1.6984 1.3333 1.4468 1.6417 1.9576 1.8233 1.8198 1.5760 1.4400 1.9549 1.9414 1.7499 1.5481 1.7213 1.8297 2.8050 1.4672 1.4940 2.1169 1.9642 1.6077 1.6576 1.5617 1.4853 1.5263 1.3938 1.7488 1.5479 1.5235 1.3981 1.4799 1.3674 1.4236 1.3653 1.4540 1.8414 1.7239 1.2078 1.2185 1.1765 1.1588 1.0863 1.0932 1.0726 1.0568 1.0802 1.0812 1.0635 1.0847 1.0744 1.0590 5.3750 4.7333 1.0801 1.0816 1.0608 1.0653 1.0603 1.0379 1.0404 1.0596 1.0633 1.0618 1.0967 1.0966 1.0966 1.0955 1.1020 1.1017 1.1016 1.0968 1.0980 1.0978 1.0628 1.0623 1.1136 1.1130
irintensity: 0.2998 0.0769 0.0112 0.1540 0.0261 0.0954 0.1834 0.5525 0.1748 0.1437 0.5595 0.5895 0.1839 0.1861 0.3023 0.3006 0.0116 2.9402 1.2290 1.0149 0.6554 5.7843 1.9134 2.2913 3.1548 0.6196 0.6390 0.1056 1.7941 1.2184 2.5584 4.5692 1.0836 1.6760 19.9745 68.7992 40.8948 2.4863 12.7883 6.2470 1.9047 4.0042 2.2919 5.6855 1.6334 3.8122 0.8907 4.4196 1.0573 0.6457 1.6145 3.4236 2.0419 3.6535 5.0769 0.1816 2.1668 0.1717 3.8235 3.2616 11.9397 1.5676 3.1997 4.2171 0.0511 2.0522 1.7828 0.3111 1.3343 0.8422 4.0408 23.9293 17.5200 0.6833 8.9783 0.3084 11.8858 5.9011 21.5529 5.0466 7.9254 7.5033 21.8569 9.0541 5.0205 26.1368 31.6804 22.3737 14.0937 2.4080 28.3263 90.6589 38.3216 16.7789 30.5023 44.1802 12.8447 13.1115 92.6918 21.0200 58.1843 14.2988 38.3518 89.6581 31.7860 38.2836 31.8236 6.3995 9.9808 35.1348 22.7111
temp: 298.150 k
press: 1.00000 atm
elementType: 6 6 6 6 6 6 6 6 6 6 6 6 6 6 6 1 1 1 1 1 1 1 1 1 1 1 1 1 1 1 1 1 1 1 1 1 1 1 1
symmnumber: 1
zpe: 920287.9 jmol-1
zpe.correction: 0.350519 hartree
zpe.thermalcorrener: 0.364959 hartree
zpe.thermalcorrenthalpy: 0.365903 hartree
zpe.thermalcorrgfe: 0.311059 hartree
zpe.sumelectzpe: -584.783966 hartree
zpe.sumelectthermal: -584.769526 hartree
zpe.sumelectthermalent: -584.768582 hartree
zpe.sumelectthermalfe: -584.823426 hartree
dipole: -0.3250 -0.7568 -0.8793
dipole: 1.2048
quadrupole: -92.5655 -96.7070 -93.3224
quadrupole: 1.3014 -1.2064 0.3826
quadrupole: 1.6328 -2.5087 0.8759 1.3014 -1.2064 0.3826
hfenergy: -585.1344855 hartree
pointgroup: C01 [X(C15H24)]
dipole: 0.1232173 -0.3000206 0.3456647 debye
polarizability: 173.8961788|-3.1339159|149.5417076|5.5034722|-8.9058192|138.5612794 unknown
InChI: InChI=1S/C15H24/c1-11(2)13-7-9-15(4)8-5-6-12(3)14(15)10-13/h13-14H,1,3,5-10H2,2,4H3
charge 0 multiplicity 1
39 atoms
C  1.018489 -1.024931 -0.153323
C  0.660679 0.41927 0.380533
C  -0.101453 -2.003449 0.311078
C  -0.746222 0.872009 -0.067497
C  2.368824 -1.460705 0.49095
C  -1.840977 -0.122961 0.413889
C  -1.524822 -1.558728 -0.094702
C  1.7952 1.399073 0.084201
C  3.522882 -0.46737 0.225173
C  1.14343 -1.049257 -1.70002
C  3.137181 0.971533 0.667756
C  -3.255918 0.338824 0.037024
C  1.654195 2.545298 -0.632656
C  -4.190199 0.632342 1.197636
C  -3.655463 0.482225 -1.255176
H  0.624252 0.310486 1.492085
H  -0.057689 -2.087289 1.418402
H  0.105887 -3.015763 -0.091932
H  -0.960292 1.878565 0.341774
H  -0.794028 0.966237 -1.169313
H  2.643371 -2.470059 0.122436
H  2.221745 -1.552382 1.588595
H  -1.780495 -0.154358 1.524764
H  -1.643494 -1.58864 -1.194791
H  -2.270053 -2.268702 0.314521
H  3.780826 -0.464361 -0.851155
H  4.431112 -0.7927 0.768994
H  1.499137 -2.041573 -2.036981
H  0.177686 -0.856042 -2.197779
H  1.854312 -0.286515 -2.062041
H  3.930669 1.687908 0.385017
H  3.066034 0.983528 1.777149
H  0.693467 2.858211 -1.055045
H  2.507898 3.210029 -0.813443
H  -4.317353 -0.263775 1.837376
H  -3.772373 1.426483 1.84835
H  -5.18842 0.956776 0.855845
H  -4.66899 0.814641 -1.508246
H  -2.987035 0.275321 -2.099651
