program: Gaussian 09
title: 000284107
version: EM64L-G09RevD.01
frameworkgroup: C1[X(C18H19NO2)]
method: RPBEPBE
basis: SDD
operation: Freq
keyword: #p
keyword: freq=noraman
keyword: PBEPBE/SDD
title: #p freq=noraman PBEPBE/SDD
converged: YES YES NO NO
title: Mulliken charges:
elementType: O O N C C C C C C C C C C C C C C C C C C H H H H H H H H H H H H H H H H H H H
charge: -0.258317 -0.269740 -0.148131 0.400937 0.517339 -0.358081 -0.371248 -0.402461 -0.419333 -0.294141 -0.646855 -0.645191 0.299583 -0.325573 0.088074 -0.343635 -0.343195 0.319961 -0.376484 -0.361295 -0.537277 0.236500 0.238913 0.222003 0.234369 0.270663 0.237639 0.219628 0.237797 0.218775 0.238784 0.238761 0.200787 0.215533 0.282961 0.237876 0.251761 0.222626 0.246926 0.222757
chargesum: 0.00000
title: Mulliken charges with hydrogens summed into heavy atoms:
elementType: O O N C C C C C C C C C C C C C C C C C C
charge: -0.258317 -0.269740 -0.148131 0.400937 0.517339 -0.121581 -0.132334 -0.180458 -0.184963 -0.023478 0.048209 0.051129 0.299583 -0.124786 0.088074 -0.128102 -0.060234 0.319961 -0.138607 -0.109534 0.155031
polarizability: 5.43421521e+02 -1.18183671e+01 2.22330852e+02 -8.24770113e-01 8.87645801e-02 9.65788991e+01
1716.lowfreq: -3.7830 -0.0004 0.0006 0.0006 3.2912 7.1869 17.2234 26.1475 34.9244
frequency: 16.6719 26.0309 34.8817 53.6283 72.4316 78.8848 111.6273 116.8629 125.7378 142.1863 168.9257 176.6373 197.8840 209.4319 227.3035 257.0325 259.9325 291.0900 312.7299 362.1567 381.4350 413.3940 415.9200 424.8024 465.8570 467.2566 502.9220 513.8725 521.8762 535.8066 592.6690 630.1875 635.2434 672.7377 695.6125 736.5509 758.7247 760.3975 803.1623 806.1499 810.2800 823.9933 855.0658 876.0309 881.0531 939.0178 941.2234 949.1631 959.7598 984.7448 993.7897 997.6180 1001.9130 1012.8963 1034.1707 1056.1711 1106.6942 1111.2856 1111.5368 1112.5214 1131.6012 1154.6593 1165.6404 1177.9362 1199.8095 1220.8020 1230.8944 1238.0099 1258.0508 1289.1064 1311.4853 1332.1510 1337.6493 1369.7815 1375.2808 1382.6636 1425.5815 1430.5958 1437.0581 1450.4991 1458.9215 1465.5225 1467.6106 1471.7935 1477.2167 1491.8991 1496.7273 1502.6909 1506.2191 1530.5595 1549.1521 1576.7287 1612.9630 1622.6325 1637.4366 2945.1848 2952.5891 2962.2003 3012.9322 3016.1635 3051.3340 3090.2694 3098.1703 3108.8617 3124.5063 3127.0654 3131.0544 3137.4134 3148.5893 3151.2575 3164.9121 3165.8327 3170.1859 3171.9156
redmass: 3.3251 3.9183 4.9855 5.0155 3.2657 2.7902 2.0993 2.9990 4.6113 2.6788 2.2650 6.4134 1.1433 3.8850 1.1619 2.3408 3.6004 6.1375 4.2699 4.2815 3.7499 2.9217 4.2992 2.9353 4.5530 3.9010 2.8023 3.8153 2.2815 4.3225 5.6889 7.0028 7.0585 3.3113 4.9981 3.2198 5.7631 3.6236 6.4923 1.2789 1.3783 1.7871 1.5604 1.9629 4.5221 1.4071 3.1031 1.3754 1.3486 8.4748 2.9593 3.0888 1.3441 1.2470 2.9573 1.5003 1.2383 1.3402 1.3247 1.2602 1.5223 1.3261 1.7044 1.3100 1.1895 1.9312 2.3916 1.8857 2.8561 1.3866 1.7774 1.3654 2.0542 3.5078 4.7338 4.2442 4.1823 1.2601 1.1720 2.5953 1.2725 1.0397 1.0498 1.0820 1.0454 1.1237 2.8560 2.5175 1.5063 2.6966 6.0539 7.1837 5.8175 5.9648 6.0076 1.0366 1.0391 1.0328 1.0997 1.1026 1.1040 1.0888 1.0967 1.0946 1.0895 1.0995 1.0884 1.0889 1.0868 1.0880 1.0936 1.0947 1.0937 1.0970
irintensity: 0.2288 0.4199 0.7489 0.0264 0.0029 0.1379 7.3027 3.4565 0.5682 1.7814 3.8752 0.3088 0.0868 0.0903 0.1997 1.6175 9.2155 5.0961 0.1736 18.9922 3.5325 0.0413 3.7950 0.2516 1.5493 7.1768 2.1292 5.3867 30.5758 36.6773 42.8483 0.9244 0.8978 6.1106 12.1486 0.1301 0.8429 2.6651 7.2199 3.5121 27.7589 102.1375 48.7996 0.1215 6.6513 0.8712 31.4913 1.4262 0.2619 78.9656 1.8759 30.8025 0.1219 37.9588 104.2661 26.3674 0.0138 41.3529 1.2560 0.2423 10.6126 36.8371 28.8146 455.1372 118.9357 295.8200 19.4237 189.4006 27.5388 12.3399 76.1593 22.2644 244.4006 164.3025 30.8674 60.3053 20.6803 25.9391 6.6614 54.7578 43.8362 0.0041 13.6796 60.8535 23.0261 29.2672 125.4864 353.1943 36.5625 387.2452 11.5367 210.6229 875.4584 304.8949 44.2962 92.3828 183.6900 76.8292 8.7463 73.1490 47.4226 1.0973 4.2611 48.4372 7.6542 31.7138 5.8224 11.7215 13.4937 0.3422 14.0949 30.1785 24.2682 10.2882
temp: 298.150 k
press: 1.00000 atm
elementType: 8 8 7 6 6 6 6 6 6 6 6 6 6 6 6 6 6 6 6 6 6 1 1 1 1 1 1 1 1 1 1 1 1 1 1 1 1 1 1 1
symmnumber: 1
zpe: 849667.7 jmol-1
zpe.correction: 0.323621 hartree
zpe.thermalcorrener: 0.344074 hartree
zpe.thermalcorrenthalpy: 0.345019 hartree
zpe.thermalcorrgfe: 0.272099 hartree
zpe.sumelectzpe: -900.973550 hartree
zpe.sumelectthermal: -900.953097 hartree
zpe.sumelectthermalent: -900.952153 hartree
zpe.sumelectthermalfe: -901.025073 hartree
dipole: -5.5697 6.6103 0.0486
dipole: 8.6441
quadrupole: -69.1592 -115.4995 -131.5696
quadrupole: 12.1506 0.1837 0.0598
quadrupole: 36.2503 -10.0901 -26.1601 12.1506 0.1837 0.0598
hfenergy: -901.2971716 hartree
pointgroup: C01 [X(C18H19N1O2)]
dipole: 2.2157526 2.5737936 -0.1781121 debye
polarizability: 543.5906953|9.0112662|221.525216|2.8185207|-8.7401126|97.2153604 unknown
InChI: InChI=1S/C18H19NO2/c1-19(2)16-9-4-14(5-10-16)6-13-18(20)15-7-11-17(21-3)12-8-15/h4-13H,1-3H3
charge 0 multiplicity 1
40 atoms
O  -6.771335 1.118985 -0.108718
O  -1.581027 -2.623642 0.193474
N  6.221372 0.922767 0.024539
C  4.923373 0.412945 0.044625
C  2.22558 -0.636186 0.086693
C  3.781284 1.283608 0.004442
C  4.676343 -0.997724 0.106877
C  2.480272 0.767806 0.024952
C  3.365465 -1.493705 0.127227
C  0.891122 -1.221638 0.109554
C  6.446203 2.373643 -0.038781
C  7.371917 0.008995 0.063625
C  -2.899915 -0.614963 0.044975
C  -0.322555 -0.574898 0.069894
C  -1.585842 -1.344485 0.107134
C  -3.028403 0.791124 -0.097414
C  -4.093815 -1.390229 0.129309
C  -5.46475 0.618217 -0.066261
C  -4.294144 1.413198 -0.154521
C  -5.358241 -0.791106 0.076386
C  -6.94263 2.567253 -0.254236
H  3.918823 2.367492 -0.042289
H  5.510212 -1.703968 0.139645
H  1.638872 1.469411 -0.006656
H  3.207158 -2.578361 0.175378
H  0.83482 -2.319622 0.165215
H  6.011769 2.817684 -0.957122
H  7.528434 2.576348 -0.045139
H  6.007491 2.895962 0.835179
H  8.304862 0.593215 0.039034
H  7.377644 -0.680196 -0.804764
H  7.377348 -0.604335 0.987156
H  -0.369399 0.517391 0.014642
H  -2.140877 1.427223 -0.171121
H  -3.985327 -2.474403 0.235989
H  -4.355609 2.499812 -0.266407
H  -6.277113 -1.381501 0.142012
H  -6.48969 3.112382 0.596417
H  -8.030495 2.7279 -0.261254
H  -6.505202 2.9300 -1.204491
