program: Gaussian 09
title: 000283445
version: EM64L-G09RevD.01
frameworkgroup: C1[X(C21H20NOP)]
method: RPBEPBE
basis: SDD
operation: Freq
keyword: #p
keyword: freq=noraman
keyword: PBEPBE/SDD
title: #p freq=noraman PBEPBE/SDD
converged: YES YES NO NO
title: Mulliken charges:
elementType: P O N C C C C C C C C C C C C C C C C C C C C C H H H H H H H H H H H H H H H H H H H H
charge: 1.004692 -0.643881 -0.526715 -0.069047 -0.258828 -0.729530 0.450169 -0.090429 -0.100495 -0.375119 -0.403039 -0.233999 -0.303298 -0.305840 -0.246356 -0.245219 -0.232196 -0.240482 -0.226655 -0.210107 -0.209973 -0.229172 -0.226295 -0.225443 0.283329 0.271663 0.248303 0.226857 0.220754 0.258273 0.235122 0.238634 0.285252 0.286263 0.249663 0.224401 0.225564 0.227807 0.232988 0.233603 0.233204 0.232205 0.231495 0.231876
chargesum: 0.00000
title: Mulliken charges with hydrogens summed into heavy atoms:
elementType: P O N C C C C C C C C C C C C C C C C C C C C C
charge: 1.004692 -0.643881 -0.526715 0.214281 0.012835 -0.033615 0.450169 -0.090429 -0.100495 -0.116845 -0.167917 0.004635 -0.018046 -0.019577 0.003307 -0.020818 -0.006633 -0.012674 0.006333 0.023496 0.023232 0.003033 0.005200 0.006433
polarizability: 2.93961229e+02 2.74956600e+01 2.29475102e+02 1.51825658e+01 -9.92394839e+00 2.30121748e+02
1716.lowfreq: -8.9685 -5.2685 -0.0012 -0.0007 0.0013 4.2228 11.1395 26.5188 27.4505
frequency: 9.6029 26.4408 27.4390 39.0440 42.5272 50.4990 61.6645 92.5594 130.6663 143.8237 155.8081 161.5637 182.0506 199.5012 219.3782 226.2691 253.8197 277.5290 297.7691 388.3381 396.0865 400.2792 401.5075 408.0996 419.2175 444.7346 447.3353 494.3196 526.6156 538.9595 611.3570 611.5742 615.6693 616.2035 638.2269 681.2815 699.7556 704.2173 707.8854 710.8363 743.4132 759.5052 767.1439 775.1944 799.5936 851.8817 858.8228 862.4398 867.2562 927.7014 934.5846 941.8129 964.0450 982.0685 984.7949 985.8151 986.8958 988.7193 990.0198 990.9615 997.5814 1004.7678 1005.8755 1014.9785 1021.5978 1021.6416 1026.6982 1044.9917 1075.1643 1078.6868 1082.5421 1092.7187 1094.5867 1124.4505 1144.2688 1170.2249 1173.7350 1174.0940 1181.8262 1186.4182 1190.2823 1195.5249 1257.1264 1308.9579 1310.8645 1313.9996 1357.4112 1378.6864 1380.0518 1381.8265 1392.5266 1399.2111 1425.8464 1428.3227 1441.8813 1464.8210 1466.6745 1468.2495 1471.5163 1486.8496 1586.7532 1589.7278 1590.9203 1596.3678 1597.5484 1617.0402 2987.6966 3055.9578 3066.3052 3075.9513 3103.5430 3117.7660 3124.5535 3127.0384 3127.4912 3135.1821 3136.0968 3138.1301 3144.6318 3145.9955 3149.2576 3154.6759 3156.4644 3162.9501 3166.8186 3167.9456
redmass: 4.3932 3.7577 5.4314 5.2460 4.0059 4.1034 4.3864 4.6180 3.9312 5.0633 2.7436 1.8173 2.6376 4.0229 4.7685 5.4118 4.9067 6.1805 4.0782 4.4887 3.3383 3.9483 2.8751 2.9043 5.4674 4.2808 4.0994 3.9389 5.8634 4.7987 6.4531 6.2213 4.5674 5.8632 5.8453 6.5760 3.4274 2.5146 1.9661 1.7898 2.8347 1.7355 1.7162 2.2509 2.9744 5.7711 1.2601 1.2477 1.2420 1.3882 1.3741 1.3799 6.8636 2.3607 1.9698 1.4158 5.2831 1.7995 4.2359 3.6648 1.3117 1.3252 1.3284 1.3656 2.9440 2.8578 2.0300 1.3752 1.6074 1.5631 1.6425 2.8475 2.7842 1.4725 1.7568 1.0585 1.0559 1.0557 1.1090 1.1269 1.1364 2.0237 1.4917 1.3372 1.4569 1.3141 1.4919 8.6039 3.4670 6.2947 2.4683 1.4705 2.1140 2.1291 2.1652 2.0518 1.9967 1.0843 1.0486 2.5126 6.1400 6.1699 6.1158 5.8556 5.8291 6.1522 1.0364 1.0861 1.0904 1.0988 1.0985 1.0860 1.0870 1.0850 1.0851 1.0880 1.0883 1.0920 1.0924 1.0926 1.0954 1.0965 1.0962 1.1013 1.1015 1.1013
irintensity: 0.6087 0.0110 0.0116 0.7453 0.2886 0.0225 0.4698 0.6322 2.1916 2.7446 4.9485 3.4110 6.4023 0.6666 5.9171 6.8894 1.3993 5.0895 1.7497 0.4666 4.4242 7.0777 0.2037 0.3722 7.9450 10.2792 1.4179 13.6513 99.1915 110.8657 0.0454 0.4490 1.0368 1.8930 27.1368 19.3325 2.4782 54.7611 106.8335 40.8273 59.0132 28.1738 38.0485 22.7207 1.5890 131.2112 1.4937 0.1186 0.3426 2.6853 0.1927 1.7797 39.2816 59.2864 33.1240 1.2230 1.2907 5.8427 3.7928 10.7764 1.0810 0.1863 0.5455 7.7279 2.4174 5.3848 3.8313 32.1652 2.1877 4.0739 8.3101 48.8168 24.2467 21.3964 17.9710 0.3162 0.0256 0.0779 3.0331 7.2298 4.6931 10.5386 9.4357 0.4325 6.7089 9.0951 2.4675 0.6011 5.3143 2.8194 9.7534 36.0070 0.9057 35.4818 12.9122 14.2797 6.5133 8.5221 6.6866 17.4971 0.0065 0.0928 1.2165 0.3174 0.5960 11.5552 27.4511 2.2634 7.9114 25.0003 17.0718 5.3662 0.1917 0.0340 0.4676 0.6556 7.6091 21.2289 8.0809 8.0476 31.6599 12.4199 34.1811 25.9498 38.8729 20.3510
temp: 298.150 k
press: 1.00000 atm
elementType: 15 8 7 6 6 6 6 6 6 6 6 6 6 6 6 6 6 6 6 6 6 6 6 6 1 1 1 1 1 1 1 1 1 1 1 1 1 1 1 1 1 1 1 1
symmnumber: 1
zpe: 916838.4 jmol-1
zpe.correction: 0.349205 hartree
zpe.thermalcorrener: 0.371181 hartree
zpe.thermalcorrenthalpy: 0.372126 hartree
zpe.thermalcorrgfe: 0.294479 hartree
zpe.sumelectzpe: -1281.704733 hartree
zpe.sumelectthermal: -1281.682757 hartree
zpe.sumelectthermalent: -1281.681813 hartree
zpe.sumelectthermalfe: -1281.759460 hartree
dipole: 0.2780 -0.1515 3.1783
dipole: 3.1941
quadrupole: -133.7190 -136.8145 -145.4207
quadrupole: 4.2901 -4.0477 -1.0495
quadrupole: 4.9324 1.8369 -6.7693 4.2901 -4.0477 -1.0495
hfenergy: -1282.0539388 hartree
pointgroup: C01 [X(C21H20N1O1P1)]
dipole: 0.074672 -0.1344408 1.2471994 debye
polarizability: 289.7553139|29.9222648|233.7218257|19.4803715|-7.9728359|230.0809393 unknown
InChI: InChI=1S/C21H20NOP/c1-17-21(18-11-5-2-6-12-18)22(17)24(23,19-13-7-3-8-14-19)20-15-9-4-10-16-20/h2-17,21H,1H3
charge 0 multiplicity 1
44 atoms
P  -1.088523 0.113667 -0.995457
O  -1.275265 0.237519 -2.597207
N  0.339149 -0.80696 -0.391418
C  0.836968 -1.954951 -1.248684
C  1.641511 -0.647238 -1.15135
C  1.217977 -3.242408 -0.549389
C  2.906106 -0.494816 -0.364893
C  -0.858109 1.778361 -0.191681
C  -2.492246 -0.82027 -0.202046
C  2.939295 -0.655129 1.043694
C  4.111725 -0.192867 -1.050462
C  -0.379321 1.920236 1.131457
C  -3.675362 -0.973625 -0.961605
C  -1.184541 2.91399 -0.968795
C  -2.393143 -1.362728 1.100633
C  4.154549 -0.52436 1.75087
C  5.327631 -0.065345 -0.344258
C  5.354002 -0.232983 1.06017
C  -0.235857 3.213188 1.682509
C  -4.774482 -1.66623 -0.405934
C  -1.040188 4.204014 -0.410892
C  -3.495624 -2.055771 1.649563
C  -0.570214 4.353708 0.914855
C  -4.686667 -2.203131 0.899936
H  0.31351 -2.072197 -2.210796
H  1.59021 -0.036212 -2.066179
H  1.807279 -3.05055 0.362048
H  0.311378 -3.80813 -0.267764
H  1.823016 -3.875226 -1.224607
H  1.999397 -0.860653 1.567441
H  4.095273 -0.055835 -2.138916
H  -0.099798 1.036977 1.715414
H  -3.712255 -0.565195 -1.978081
H  -1.53051 2.772112 -1.999216
H  -1.459539 -1.267977 1.665383
H  4.166837 -0.645267 2.840224
H  6.250933 0.169029 -0.886087
H  6.29674 -0.130526 1.609295
H  0.140579 3.330812 2.704503
H  -5.693457 -1.788918 -0.989453
H  -1.29021 5.087717 -1.008086
H  -3.425348 -2.481526 2.656582
H  -0.458535 5.354954 1.346175
H  -5.540471 -2.739262 1.3296
