program: Gaussian 09
title: 000283391
version: EM64L-G09RevD.01
frameworkgroup: C1[X(C16H14N2)]
method: RPBEPBE
basis: SDD
operation: Freq
keyword: #pfreq=noraman
keyword: PBEPBE/SDD
title: #p freq=noraman PBEPBE/SDD
converged: YES YES NO NO
title: Mulliken charges:
elementType: N N C C C C C C C C C C C C C C C C H H H H H H H H H H H H H H
charge: -0.159536 -0.095326 -0.331125 0.421744 0.434868 -0.381699 -0.392439 -0.384962 -0.367776 -0.165241 -0.211991 -0.233933 -0.233670 -0.234708 -0.238943 -0.351936 -0.239356 -0.236584 0.223776 0.237104 0.239511 0.264735 0.261034 0.282297 0.259186 0.228368 0.230743 0.230497 0.230312 0.251836 0.230881 0.232329
chargesum: 0.00000
title: Mulliken charges with hydrogens summed into heavy atoms:
elementType: N N C C C C C C C C C C C C C C C C
charge: -0.159536 -0.095326 -0.107349 0.421744 0.434868 -0.144594 -0.152928 -0.120228 -0.106741 0.117056 0.047195 -0.005565 -0.002927 -0.004210 -0.008630 -0.100100 -0.008475 -0.004255
polarizability: 1.97654174e+02 -8.08192437e-01 1.78735458e+02 -7.13897496e+00 -3.43817078e-01 1.39952162e+02
1716.lowfreq: -11.4840 -5.1114 -0.0009 -0.0008 -0.0005 4.7286 21.9005 27.8343 50.0120
frequency: 21.1133 27.7645 49.9079 64.6336 66.3920 86.5642 217.1478 223.5657 249.5387 275.8735 304.5938 330.5520 400.8301 403.0063 471.2414 500.7035 589.2906 614.4443 616.2168 634.7274 642.8321 656.8391 703.7468 705.0839 732.8398 740.5736 755.3079 776.8478 814.1737 831.9124 845.7973 856.1063 858.9228 860.5447 879.9197 928.4030 936.0565 980.6455 982.8209 989.8405 991.3884 999.0824 1000.5100 1005.2320 1026.6775 1028.7117 1050.8949 1083.8231 1087.6422 1106.8629 1173.8088 1174.2748 1176.3728 1190.4178 1192.5641 1204.9551 1212.1091 1229.9751 1256.0355 1274.2423 1316.2679 1329.0337 1335.6984 1364.9411 1384.6386 1387.8542 1435.4480 1442.4106 1451.1155 1466.7338 1483.0926 1484.8153 1593.3808 1596.6376 1612.0514 1614.8185 2988.1289 3117.0490 3119.3859 3128.6720 3128.8371 3140.1867 3140.3881 3150.9022 3151.1534 3165.7340 3166.1187 3226.3731 3230.0802 3258.9704
redmass: 3.8215 3.8813 3.9487 4.9703 5.7677 4.7529 4.4548 4.2997 4.9516 5.8138 4.8348 5.1518 2.8128 2.8263 3.6449 3.5034 4.8023 6.2308 6.2274 4.2033 4.8363 3.4076 1.9785 1.9518 1.8291 1.2826 1.8886 1.3755 3.2843 3.3380 1.4242 1.2496 1.8856 1.8980 6.2921 1.4398 1.5081 1.3932 1.4154 5.9412 5.8647 1.3145 1.3552 3.7442 2.2846 2.1694 1.6187 1.6038 1.5892 1.7996 1.1673 1.0542 2.2432 1.1136 1.1244 2.3122 1.6807 2.3217 1.8680 1.9778 1.6315 2.6246 1.4027 2.2904 5.0742 5.7911 2.3343 2.1747 2.5681 4.2148 2.2545 2.2623 6.0999 6.1157 5.9828 5.9918 1.0833 1.0875 1.0875 1.0864 1.0864 1.0915 1.0914 1.0958 1.0960 1.1015 1.1015 1.0924 1.0971 1.1078
irintensity: 0.0658 0.6435 0.9797 0.4356 0.7091 0.2252 2.3458 0.6648 1.0095 0.4214 0.9120 0.4525 0.4016 0.0890 6.1426 6.2352 2.5505 0.5313 0.8010 12.3717 5.0530 25.8326 36.8876 43.1702 67.1832 21.4663 50.9870 71.6939 3.9258 4.4151 1.1045 0.0816 3.2605 3.2688 14.3278 1.8467 2.0916 0.0272 0.0139 1.0102 1.4822 0.1083 0.6125 17.8911 8.3195 12.0352 40.9752 6.2189 7.6976 12.5695 0.2669 0.1069 1.3239 3.2276 3.1130 12.4032 27.7334 16.4441 26.0200 11.6251 4.3711 1.0402 0.6471 6.4235 5.1002 4.6385 27.1658 10.8798 23.0030 5.4137 10.5052 20.5940 1.8201 0.1106 6.8254 3.5028 12.0372 7.1528 5.4666 0.0566 0.1381 12.4449 13.1025 24.5431 30.8404 31.9857 15.2039 5.4362 0.1839 2.0814
temp: 298.150 k
press: 1.00000 atm
elementType: 7 7 6 6 6 6 6 6 6 6 6 6 6 6 6 6 6 6 1 1 1 1 1 1 1 1 1 1 1 1 1 1
symmnumber: 1
zpe: 672922.3 jmol-1
zpe.correction: 0.256303 hartree
zpe.thermalcorrener: 0.270730 hartree
zpe.thermalcorrenthalpy: 0.271675 hartree
zpe.thermalcorrgfe: 0.212053 hartree
zpe.sumelectzpe: -726.347087 hartree
zpe.sumelectthermal: -726.332659 hartree
zpe.sumelectthermalent: -726.331715 hartree
zpe.sumelectthermalfe: -726.391337 hartree
dipole: 0.9554 -4.7008 0.0652
dipole: 4.7974
quadrupole: -94.4533 -122.2396 -97.2078
quadrupole: 3.5321 -1.5291 1.8846
quadrupole: 10.1803 -17.6061 7.4258 3.5321 -1.5291 1.8846
hfenergy: -726.6033895 hartree
pointgroup: C01 [X(C16H14N2)]
dipole: 0.2929424 1.8636589 0.0580766 debye
polarizability: 197.1823215|1.3031114|178.7792863|8.531587|1.6041946|140.3801867 unknown
InChI: InChI=1S/C16H14N2/c1-3-7-14(8-4-1)16(18-12-11-17-13-18)15-9-5-2-6-10-15/h1-13,16H
charge 0 multiplicity 1
32 atoms
N  0.136342 -1.6504 0.220262
N  -0.216345 -3.88826 0.059215
C  0.00553 -0.261534 0.73678
C  -1.329103 0.386082 0.336982
C  1.237807 0.574935 0.355884
C  -1.764386 1.532101 1.049998
C  2.435641 0.413834 1.097098
C  -2.13155 -0.116267 -0.714204
C  1.218987 1.479104 -0.733529
C  0.774522 -2.072278 -0.955728
C  -0.449877 -2.780345 0.790653
C  -2.978811 2.168378 0.716881
C  3.595448 1.142833 0.757204
C  -3.349236 0.521133 -1.049543
C  2.379943 2.20835 -1.07745
C  0.550039 -3.449187 -1.034783
C  -3.776812 1.664114 -0.337622
C  3.570857 2.043069 -0.3342
H  0.009904 -0.359906 1.841349
H  -1.146343 1.930465 1.864635
H  2.46026 -0.290319 1.93824
H  -1.813751 -1.009137 -1.263427
H  0.294543 1.620524 -1.304102
H  1.332655 -1.387621 -1.587223
H  -1.027387 -2.739838 1.711761
H  -3.304446 3.051094 1.278429
H  4.513829 1.011055 1.339818
H  -3.963886 0.120029 -1.863103
H  2.353446 2.905721 -1.922118
H  0.893772 -4.145663 -1.79599
H  -4.722124 2.153789 -0.596501
H  4.469235 2.611649 -0.599063
