program: Gaussian 09
title: 000283357
version: EM64L-G09RevD.01
frameworkgroup: C1[X(C4H12N2)]
method: RPBEPBE
basis: SDD
operation: Freq
keyword: #pfreq=noraman
keyword: PBEPBE/SDD
title: #p freq=noraman PBEPBE/SDD
converged: YES YES NO NO
title: Mulliken charges:
elementType: N N C C C C H H H H H H H H H H H H
charge: -0.079806 -0.563686 0.038224 -0.729644 -0.693020 -0.648390 0.171587 0.218668 0.214542 0.224747 0.260830 0.190152 0.207576 0.180980 0.225188 0.241659 0.248047 0.292346
chargesum: 0.00000
title: Mulliken charges with hydrogens summed into heavy atoms:
elementType: N N C C C C
charge: -0.079806 -0.023293 0.209811 -0.071687 -0.034462 -0.000563
polarizability: 6.62826436e+01 1.50731612e+00 6.24218225e+01 -6.63503965e-01 4.16405304e-02 5.15958998e+01
1716.lowfreq: -31.1789 -16.2194 -0.0008 -0.0003 0.0003 11.8824 83.2982 198.0831 211.4021
frequency: 83.2313 198.0655 211.3907 241.5789 290.3338 314.5239 350.6337 380.9484 425.9861 465.4245 482.9474 643.8897 710.8305 888.7190 917.4865 946.6720 984.5021 1074.8028 1099.6896 1114.7322 1160.3378 1178.5382 1210.9289 1245.2413 1319.4489 1334.9400 1364.1556 1384.8678 1423.2532 1452.0197 1462.5481 1466.0150 1475.0527 1485.4228 1498.4346 1637.5201 2836.1028 2851.1083 2980.9003 2984.6900 3035.4689 3075.3213 3080.1944 3084.6797 3094.4511 3109.0909 3309.4054 3532.4397
redmass: 2.7425 1.0948 1.1112 1.4497 1.5149 1.8399 1.3608 1.8454 2.2161 2.4959 2.3209 1.8297 2.7190 2.4038 1.1803 1.4109 1.8616 1.8906 1.6124 1.9317 2.2335 1.9932 1.5220 1.9039 1.5909 1.2768 1.2430 1.2234 1.1592 1.0546 1.0537 1.0472 1.0512 1.0484 1.0499 1.0837 1.0788 1.0597 1.0355 1.0361 1.0729 1.1000 1.1001 1.0991 1.0993 1.0985 1.0509 1.0892
irintensity: 1.0105 2.5578 3.7075 0.2903 25.4781 4.5310 12.7070 0.4183 1.1500 23.7104 5.2566 145.1326 10.7618 7.2918 2.1140 0.8521 6.0162 6.4909 0.7637 24.8517 4.3492 14.7867 2.4184 9.2986 2.3101 19.1441 29.4258 27.8328 4.0984 5.3643 4.4764 23.4209 3.6699 8.5730 10.6620 17.1054 50.5636 160.9846 28.1219 32.6958 42.8678 12.0192 46.9884 67.1135 29.4758 15.3712 33.8709 1.7729
temp: 298.150 k
press: 1.00000 atm
elementType: 7 7 6 6 6 6 1 1 1 1 1 1 1 1 1 1 1 1
symmnumber: 1
zpe: 424070.0 jmol-1
zpe.correction: 0.161520 hartree
zpe.thermalcorrener: 0.169681 hartree
zpe.thermalcorrenthalpy: 0.170626 hartree
zpe.thermalcorrgfe: 0.130201 hartree
zpe.sumelectzpe: -268.547368 hartree
zpe.sumelectthermal: -268.539207 hartree
zpe.sumelectthermalent: -268.538262 hartree
zpe.sumelectthermalfe: -268.578687 hartree
dipole: -1.3004 0.9144 0.7822
dipole: 1.7717
quadrupole: -34.8369 -40.5719 -39.7083
quadrupole: 1.5189 -0.0152 0.3234
quadrupole: 3.5355 -2.1996 -1.3359 1.5189 -0.0152 0.3234
hfenergy: -268.708888 hartree
pointgroup: C01 [X(C4H12N2)]
dipole: 0.4949804 0.3695891 -0.3229098 debye
dipolederiv: -0.25467 -0.2225555 -0.0136292 -0.0450721 -0.1341285 0.0795425 -0.038436 0.0955744 -0.4763014 -0.3795996 -0.1772781 -0.0964062 -0.2546907 -0.4811649 0.005562 -0.0810645 -0.1199068 0.0516442 0.5377375 0.0221989 0.0783947 -0.0207788 0.1588827 -0.0075126 0.0611017 -0.0038886 0.4193825 -0.0507192 0.077674 0.0197285 0.077227 -0.0666872 -0.0297873 -0.0094007 -0.0283818 0.0608307 -0.0573946 -0.0565948 0.0366977 -0.0367003 -0.1067606 0.0206825 0.0266376 0.030374 0.071765 0.1122056 0.0934146 -0.0566595 0.1683237 0.1817643 -0.1099063 -0.0875143 -0.0600282 0.37284 -0.0693735 -0.0058673 0.0699231 0.0038167 0.0021585 0.0016068 -0.0695105 -0.0002448 -0.2997347 0.0645646 -0.1069037 0.0562485 -0.0704308 -0.1337998 0.0699838 0.0528978 0.0831377 0.0341085 -0.1721474 0.0157836 -0.0551707 -0.0331082 0.0918956 -0.0171542 -0.0721375 -0.0057388 0.0794244 0.1121368 -0.0075093 -0.0361061 0.0059114 0.0673947 -0.0021254 0.0128172 -0.0578692 -0.1465863 0.1269644 0.1154465 0.0118989 0.064411 -0.0752568 -0.0265425 0.014194 -0.0341721 0.085758 -0.1607234 -0.0500207 -0.0961685 -0.004567 0.083848 0.0186249 -0.1241651 0.000014 0.0257472 0.0812545 -0.0156867 0.0249748 -0.0002116 0.0777642 -0.0455762 0.0744108 0.0124286 -0.1628391 0.0212503 -0.0644046 0.0109955 -0.0538724 -0.0273656 0.0002291 0.1304139 0.1516803 -0.2651448 -0.1585673 -0.0305233 -0.0894309 0.0413883 0.0801301 0.0325014 -0.0904831 0.0232573 0.0341827 0.0921111 0.0995409 0.0582087 0.05433 -0.137176 -0.0708452 0.0691099 -0.056482 0.0452503 0.0857176 0.1457228 0.1468834 0.0525824 0.158195 0.1128078 0.187318 -0.0172166 -0.0333039 0.0692525 0.1675627 -0.0703828 0.0514413 0.2603063 -0.0320912 -0.0561893 -0.0125372 0.1029769 unknown
polarizability: 66.1868697|-1.4619494|62.4062926|-1.4279308|0.3186237|51.7072035 unknown
InChI: InChI=1S/C4H12N2/c1-4(2)6(3)5/h4H,5H2,1-3H3
charge 0 multiplicity 1
18 atoms
N  0.701607 -0.029035 0.209602
N  1.385219 -1.215993 -0.256132
C  -0.690593 0.009583 -0.358253
C  -1.422507 1.302914 0.062668
C  -1.472642 -1.229549 0.117777
C  1.507494 1.190984 -0.049449
H  -0.63355 -0.01512 -1.478543
H  -1.011313 2.207959 -0.417985
H  -2.487143 1.229533 -0.222973
H  -1.369418 1.428029 1.160037
H  -0.89326 -2.141144 -0.098296
H  -2.451101 -1.286846 -0.394054
H  -1.645961 -1.172386 1.208217
H  1.659681 1.392187 -1.141716
H  2.499377 1.064408 0.418881
H  1.032398 2.076581 0.402838
H  1.852707 -1.101175 -1.173885
H  2.013308 -1.583432 0.465465
