program: Gaussian 09
title: 000028207
version: EM64L-G09RevD.01
frameworkgroup: C1[X(C10H14N2O2)]
method: RPBEPBE
basis: SDD
operation: Freq
keyword: #p
keyword: freq=noraman
keyword: PBEPBE/SDD
title: #p freq=noraman PBEPBE/SDD
converged: YES YES NO NO
title: Mulliken charges:
elementType: O O N N C C C C C C C C C C H H H H H H H H H H H H H H
charge: -0.305621 -0.263625 -0.447296 -0.697319 0.187085 0.560053 0.353375 -0.649538 -0.298798 -0.423301 -0.232778 -0.690294 0.204412 -0.803454 0.208034 0.239349 0.303841 0.302909 0.209064 0.209028 0.298264 0.335541 0.210455 0.228618 0.228675 0.234240 0.266688 0.232393
chargesum: 0.00000
title: Mulliken charges with hydrogens summed into heavy atoms:
elementType: O O N N C C C C C C C C C C
charge: -0.305621 -0.263625 -0.144387 -0.063513 0.187085 0.560053 0.353375 -0.441504 -0.059449 -0.119460 0.185314 -0.022547 0.204412 -0.070132
polarizability: 2.13516409e+02 5.73081541e+00 1.38650383e+02 9.09219089e-03 -3.23911585e-02 6.87406913e+01
1716.lowfreq: -90.9601 -13.0049 -5.4794 -5.3294 -0.0008 -0.0004 -0.0003 41.0508 56.9529
frequency: -90.9588 40.9791 56.9429 86.6183 99.5381 103.7190 166.2874 172.8670 232.3816 238.2089 262.1863 278.6505 316.3694 327.4746 365.7714 383.5061 435.3798 484.6930 492.2219 513.1970 570.2493 574.8194 613.1933 631.2224 642.9822 722.6531 749.4330 777.0929 804.8704 828.9869 840.2429 887.2640 914.4346 936.4893 956.8539 991.5541 1026.7524 1042.2081 1056.4676 1114.1517 1138.7589 1139.2804 1189.2211 1204.0663 1242.0283 1259.6203 1285.1502 1328.7302 1366.3405 1371.8126 1388.1879 1397.9204 1436.4698 1454.1647 1461.7163 1467.9630 1478.3428 1489.7471 1511.1568 1533.3259 1604.9285 1612.5553 1629.3551 1637.3814 2954.4390 2984.3263 2995.1988 3010.5357 3069.3138 3093.0300 3100.1691 3102.3300 3133.9077 3153.5702 3207.1217 3523.7667 3567.4854 3716.1221
redmass: 1.0506 3.5427 5.5986 3.9767 3.9175 1.6790 3.9325 4.8362 2.5218 1.4289 4.0777 4.9249 1.2568 3.8165 3.4226 4.4997 2.3599 1.1424 3.8708 4.9605 4.5384 3.2353 1.5633 5.6892 2.1597 2.4717 4.2461 5.4312 1.3702 1.1978 1.7771 3.5792 3.7864 1.3303 2.7279 1.7036 1.6489 2.8038 1.6641 2.2050 1.5163 1.4437 2.7511 2.4922 1.7747 1.1389 1.5893 3.0451 1.3902 1.2336 3.5904 1.3825 2.4993 1.2961 1.0406 1.0475 1.0602 1.1274 2.6195 2.6382 1.9870 2.7360 5.0351 3.5795 1.0555 1.0382 1.0360 1.1074 1.0985 1.0989 1.0910 1.1014 1.0977 1.0898 1.0944 1.0763 1.0443 1.1045
irintensity: 0.0026 3.5170 8.3624 0.0837 5.0279 3.1598 1.5057 0.6949 11.7773 0.1359 1.0070 6.4595 179.0035 1.5920 0.0319 29.2260 21.0927 73.3849 2.1610 13.7365 18.2874 4.9195 60.5313 1.3147 10.3015 6.1341 13.8259 0.4465 30.7638 7.6087 76.9575 19.8367 10.3299 6.6274 17.1172 19.7352 7.8515 57.7095 8.3515 3.1344 116.9229 4.5410 134.2668 118.0102 104.2351 0.0182 30.3642 15.1047 34.3362 40.7954 240.6827 4.1784 44.2550 8.8695 11.8862 19.0336 23.3110 59.7694 443.7890 2.1162 0.3107 50.8890 221.8874 216.4544 39.7670 13.1948 26.9792 36.1912 18.3729 29.4946 23.5279 38.2927 8.3110 15.0778 7.6082 9.5602 76.6553 34.0618
temp: 298.150 k
press: 1.00000 atm
elementType: 8 8 7 7 6 6 6 6 6 6 6 6 6 6 1 1 1 1 1 1 1 1 1 1 1 1 1 1
symmnumber: 1
zpe: 598003.9 jmol-1
zpe.correction: 0.227768 hartree
zpe.thermalcorrener: 0.241915 hartree
zpe.thermalcorrenthalpy: 0.242859 hartree
zpe.thermalcorrgfe: 0.186537 hartree
zpe.sumelectzpe: -648.375592 hartree
zpe.sumelectthermal: -648.361444 hartree
zpe.sumelectthermalent: -648.360500 hartree
zpe.sumelectthermalfe: -648.416823 hartree
dipole: 1.8357 3.9589 -0.0130
dipole: 4.3638
quadrupole: -67.1715 -74.6156 -87.8096
quadrupole: -16.9224 -0.0675 -0.0771
quadrupole: 9.3607 1.9166 -11.2774 -16.9224 -0.0675 -0.0771
hfenergy: -648.6033594 hartree
pointgroup: C01 [X(C10H14N2O2)]
dipole: 0.7547925 -1.5398942 0.0811196 debye
polarizability: 213.679005|-4.2931111|138.2137211|-2.3164742|-3.9858973|69.0147574 unknown
InChI: InChI=1S/C10H14N2O2/c1-3-14-10-5-4-8(6-9(10)11)12-7(2)13/h4-6,12H,3,11H2,1-2H3
charge 0 multiplicity 1
28 atoms
O  2.997369 -0.070798 -0.19793
O  -3.506239 1.612057 -0.175987
N  -2.641113 -0.570721 -0.064099
N  1.865928 -2.480255 -0.036771
C  1.582856 -0.072881 -0.172923
C  -1.229883 -0.34627 -0.104297
C  1.010023 -1.383309 -0.08506
C  -0.398319 -1.498902 -0.05183
C  0.756122 1.061743 -0.225006
C  -0.65464 0.943285 -0.191755
C  3.670736 1.235739 -0.282993
C  5.173779 0.968439 -0.290093
C  -3.679664 0.359155 -0.100333
C  -5.07283 -0.276223 -0.042524
H  -0.847669 -2.499291 0.015849
H  1.192571 2.062937 -0.292697
H  -1.298185 1.821988 -0.232292
H  -2.922758 -1.551979 -0.00173
H  3.348582 1.754212 -1.209664
H  3.376154 1.857323 0.587822
H  1.509436 -3.427307 0.031648
H  2.868245 -2.314799 -0.062709
H  5.727327 1.923133 -0.349333
H  5.481116 0.444092 0.63114
H  5.456546 0.347093 -1.157248
H  -5.24928 -0.938541 -0.910677
H  -5.822477 0.52784 -0.055281
H  -5.207834 -0.872762 0.879073
