program: Gaussian 09
title: 000283365
version: EM64L-G09RevD.01
frameworkgroup: C1[X(C15H13NO5)]
method: RPBEPBE
basis: SDD
operation: Freq
keyword: #p
keyword: freq=noraman
keyword: PBEPBE/SDD
title: #p freq=noraman PBEPBE/SDD
converged: YES YES NO NO
title: Mulliken charges:
elementType: O O O O O N C C C C C C C C C C C C C C C H H H H H H H H H H H H H
charge: -0.270180 -0.264027 -0.245036 -0.199677 -0.199758 0.027871 -0.277323 -0.329511 0.239443 -0.320549 -0.304304 0.366323 0.193931 0.388972 -0.348808 -0.343019 -0.348859 -0.376260 -0.221247 -0.194919 -0.255062 0.252254 0.217263 0.250441 0.229754 0.281343 0.286861 0.291888 0.290835 0.247038 0.249992 0.225353 0.229199 0.229778
chargesum: 0.00000
title: Mulliken charges with hydrogens summed into heavy atoms:
elementType: O O O O O N C C C C C C C C C C C C C C C
charge: -0.270180 -0.264027 -0.245036 -0.199677 -0.199758 0.027871 0.192193 0.150685 0.239443 -0.039206 -0.017443 0.366323 0.193931 0.388972 -0.056919 -0.052184 -0.101822 -0.126267 0.004106 0.034279 -0.025284
polarizability: 2.42669056e+02 -1.38047921e+01 1.75643802e+02 1.03059879e+00 2.94553954e+01 1.53503932e+02
1716.lowfreq: -15.7739 -5.1742 -0.0004 0.0001 0.0001 1.8204 14.0858 19.4900 29.4012
frequency: 13.2829 18.8845 29.3172 42.4335 62.6620 74.3029 86.9877 97.1271 145.8938 167.2658 207.2467 231.4249 238.1588 260.2259 280.4342 345.4800 404.7278 409.1497 411.4697 422.3456 457.2075 477.8184 497.6287 503.1169 516.8928 590.1685 608.8486 623.3796 653.6976 676.7825 686.3885 692.6952 743.0084 758.8986 765.0058 773.2376 797.9641 822.7039 848.6793 864.5918 888.9452 891.5264 910.1125 962.1987 982.6816 984.2026 1000.7717 1005.4974 1007.9941 1011.4007 1021.2358 1038.5920 1070.3468 1083.3824 1089.0342 1102.2741 1108.5287 1167.8522 1175.8809 1177.4328 1209.8111 1218.4707 1219.5774 1248.7726 1276.0544 1293.1999 1313.2810 1365.2685 1368.3733 1376.8088 1391.8878 1405.1214 1414.9897 1431.9173 1442.5229 1464.9627 1474.8063 1480.9741 1589.7501 1592.0921 1609.6061 1611.7484 1621.8712 2958.5610 3029.1470 3042.1960 3127.6195 3129.7998 3138.3354 3155.5913 3163.8085 3164.7798 3173.7049 3177.5608 3189.0354 3194.9353
redmass: 7.6138 5.5475 3.9911 8.6963 7.7060 6.5927 8.4331 6.5811 4.0066 4.9459 4.3254 5.3968 5.6098 7.5713 9.1514 2.8072 4.0487 2.8842 2.9456 5.1960 4.4090 6.3021 4.6721 2.9658 6.0667 4.3119 6.4499 7.1177 6.1201 7.0857 3.8755 2.1009 4.7921 1.6551 5.0990 6.2125 7.8868 1.2925 3.3882 1.2408 1.6725 1.4636 3.4946 1.3647 5.6428 1.3106 2.9293 1.3448 2.6129 1.3802 2.0958 3.0487 3.7643 1.5969 3.2394 2.3342 1.3270 1.0911 1.2286 1.1822 3.3271 3.7990 1.3266 4.6586 1.1096 1.2586 1.3338 1.3849 7.5562 1.6711 3.3532 8.1203 4.5555 1.1042 2.3157 1.2162 2.4328 1.8708 8.7396 6.4259 6.4884 6.2816 9.6181 1.0595 1.0948 1.0679 1.1051 1.0848 1.0889 1.0924 1.0958 1.0902 1.1008 1.0892 1.0957 1.0974
irintensity: 0.0406 0.2860 0.3310 0.0969 0.8045 0.8914 4.0157 0.5154 6.7904 5.4180 6.7317 1.7433 3.3575 0.0496 1.4373 18.3488 0.1263 0.0353 0.2315 3.7135 1.5359 6.0815 1.6611 13.4677 1.4037 9.0949 0.4756 0.3408 0.1868 1.8251 58.4706 38.5690 6.9674 96.3960 5.0157 33.1291 11.1451 2.4066 13.4807 0.2708 52.1751 13.5922 58.0592 0.0877 0.2446 0.7636 11.6096 0.6507 37.0750 0.2922 10.6362 100.6656 244.8441 22.4707 9.8314 1.6805 13.3142 12.4791 14.8874 35.3446 563.5038 150.7432 33.9008 161.8266 11.5515 1.1078 0.2419 3.9902 85.2636 4.4331 13.8015 11.4377 64.7980 24.4676 3.3310 85.5313 3.7309 49.5459 48.3857 24.7950 6.3332 71.8481 117.7105 32.8561 11.9357 46.8824 5.6891 3.1547 10.2324 32.0112 19.5699 1.1815 6.0034 1.1061 0.7003 0.4502
temp: 298.150 k
press: 1.00000 atm
elementType: 8 8 8 8 8 7 6 6 6 6 6 6 6 6 6 6 6 6 6 6 6 1 1 1 1 1 1 1 1 1 1 1 1 1
symmnumber: 1
zpe: 664252.6 jmol-1
zpe.correction: 0.253000 hartree
zpe.thermalcorrener: 0.271403 hartree
zpe.thermalcorrenthalpy: 0.272347 hartree
zpe.thermalcorrgfe: 0.202049 hartree
zpe.sumelectzpe: -1008.675026 hartree
zpe.sumelectthermal: -1008.656624 hartree
zpe.sumelectthermalent: -1008.655680 hartree
zpe.sumelectthermalfe: -1008.725977 hartree
dipole: -4.5313 2.4613 -0.5319
dipole: 5.1840
quadrupole: -145.8237 -120.3476 -117.0292
quadrupole: 11.7038 -4.0965 -0.5050
quadrupole: -18.0902 7.3859 10.7043 11.7038 -4.0965 -0.5050
hfenergy: -1008.9280269 hartree
pointgroup: C01 [X(C15H13N1O5)]
dipole: 1.7622232 0.9590959 0.3666415 debye
polarizability: 242.0799356|15.4532275|179.1116819|7.1456051|-27.1074367|150.6251727 unknown
InChI: InChI=1S/C15H13NO5/c17-15(12-6-8-13(9-7-12)16(18)19)21-11-10-20-14-4-2-1-3-5-14/h1-9H,10-11H2
charge 0 multiplicity 1
34 atoms
O  2.86289 0.352577 0.991292
O  0.061769 1.408607 1.078107
O  -0.37706 2.706103 -0.812309
O  -6.304023 -1.05129 -1.606235
O  -5.729855 -2.316866 0.202497
N  -5.512355 -1.359831 -0.635165
C  2.465001 1.65029 0.436519
C  1.318855 2.176979 1.290428
C  -1.935074 0.943156 -0.157389
C  -2.834559 1.245089 -1.212906
C  -2.21273 -0.122214 0.738427
C  3.91009 -0.337046 0.349321
C  -0.700585 1.777223 -0.030737
C  -4.267663 -0.559595 -0.470637
C  -4.011796 0.493312 -1.376649
C  -3.38707 -0.882575 0.584972
C  4.611763 0.147927 -0.78196
C  4.242212 -1.591384 0.918195
C  5.649295 -0.63781 -1.337984
C  5.277893 -2.360065 0.352423
C  5.988575 -1.889009 -0.779708
H  2.15585 1.552298 -0.622137
H  3.312203 2.366542 0.493642
H  1.536544 2.043585 2.360781
H  1.132461 3.238678 1.050274
H  -2.592283 2.069779 -1.890164
H  -1.505482 -0.342276 1.541692
H  -4.725296 0.700562 -2.177919
H  -3.631824 -1.709517 1.256091
H  4.366779 1.113864 -1.233547
H  3.681179 -1.938784 1.791242
H  6.191234 -0.263124 -2.213637
H  5.531046 -3.329733 0.795222
H  6.792514 -2.489854 -1.217143
