program: Gaussian 09
title: 000283348
version: EM64L-G09RevD.01
frameworkgroup: C1[X(C11H7F8N)]
method: RPBEPBE
basis: SDD
operation: Freq
keyword: #p
keyword: freq=noraman
keyword: PBEPBE/SDD
title: #p freq=noraman PBEPBE/SDD
converged: YES YES NO NO
title: Mulliken charges:
elementType: F F F F F F F F N C C C C C C C C C C C H H H H H H H
charge: -0.154548 -0.152105 -0.134168 -0.142751 -0.125945 -0.137462 -0.133449 -0.138092 -0.122629 0.167831 0.194377 -0.530217 0.335545 0.345518 0.457000 -0.353226 -0.425398 -0.217022 -0.213707 -0.234404 0.261829 0.257246 0.256659 0.235619 0.235053 0.233167 0.235279
chargesum: 0.00000
title: Mulliken charges with hydrogens summed into heavy atoms:
elementType: F F F F F F F F N C C C C C C C C C C C
charge: -0.154548 -0.152105 -0.134168 -0.142751 -0.125945 -0.137462 -0.133449 -0.138092 -0.122629 0.167831 0.194377 -0.011142 0.335545 0.345518 0.457000 -0.096567 -0.189779 0.018031 0.019461 0.000875
polarizability: 1.57743158e+02 1.09072496e+01 9.67510511e+01 -1.56347171e+00 -1.25859825e+01 1.14280293e+02
1716.lowfreq: -11.0167 -7.6970 -5.5798 -0.0008 -0.0004 -0.0003 11.2867 15.6241 20.2625
frequency: 10.0288 15.0094 20.0999 30.9132 38.7619 85.2148 98.1021 116.3572 148.1933 172.2618 183.8752 227.9367 248.9373 262.8558 269.4912 288.5229 292.6762 361.1747 370.5582 399.9822 403.0133 454.5850 460.1976 485.6613 515.7301 521.6451 548.1975 571.5913 613.3713 616.6138 662.1634 698.6124 705.5089 745.2431 763.3767 810.0681 841.7963 856.1950 914.2195 930.8236 935.9538 969.0581 982.2579 990.8886 1002.0075 1020.9414 1024.8882 1027.7216 1044.4229 1048.1577 1071.3041 1085.5820 1099.6411 1175.4468 1175.8428 1191.5321 1208.3102 1219.5759 1231.9019 1315.7587 1348.3879 1387.4906 1442.6890 1463.5629 1486.4613 1500.8834 1597.7207 1616.8998 2997.0375 3053.1830 3123.4623 3131.3435 3141.9266 3153.9000 3169.3007
redmass: 6.2068 14.1922 4.8044 16.3548 8.5245 7.0906 10.9844 6.5576 8.2726 9.9120 16.7672 5.1163 15.5360 17.0717 17.1398 14.3894 3.4763 16.6810 12.2713 6.1336 2.9424 8.9822 4.7351 12.5083 11.5932 11.1272 8.0142 9.8980 9.8697 6.7014 13.2945 3.2873 3.8047 1.6249 10.1417 4.2348 6.0713 1.2558 1.4163 8.4746 12.4704 2.5414 1.4041 6.1737 1.3536 4.1438 12.3750 2.2391 10.2219 11.0242 12.8291 1.9214 4.8144 4.8675 1.1156 1.1482 4.8186 3.5813 1.2360 1.4080 1.4248 6.5837 2.1373 1.3163 2.3666 3.3682 6.1049 6.0203 1.0581 1.1050 1.0877 1.0867 1.0916 1.0963 1.1016
irintensity: 0.0808 0.1125 0.0217 0.2725 0.0437 0.8791 0.7600 4.8418 0.7311 6.2930 3.8490 8.4776 4.1544 0.0412 0.3021 0.4619 2.5657 0.7629 3.9071 5.0884 0.0805 5.7966 12.6706 1.4794 2.7664 1.6191 15.8171 26.0654 23.5919 2.4358 5.4914 16.8275 22.6908 46.5314 60.6121 15.3605 9.0191 0.3421 14.5971 58.7407 51.4543 67.5046 2.5300 2.1610 3.3616 9.6424 202.8891 9.8605 269.9988 150.6194 271.3573 21.1235 35.2153 228.4841 17.8174 5.2618 54.1665 98.0407 11.2541 16.5449 17.7877 4.6434 14.2671 50.9415 4.9197 84.7798 0.8168 1.6416 15.2501 5.2586 5.8313 0.3141 11.3542 28.3614 17.0011
temp: 298.150 k
press: 1.00000 atm
elementType: 9 9 9 9 9 9 9 9 7 6 6 6 6 6 6 6 6 6 6 6 1 1 1 1 1 1 1
symmnumber: 1
zpe: 431822.0 jmol-1
zpe.correction: 0.164472 hartree
zpe.thermalcorrener: 0.183203 hartree
zpe.thermalcorrenthalpy: 0.184147 hartree
zpe.thermalcorrgfe: 0.112534 hartree
zpe.sumelectzpe: -1275.315767 hartree
zpe.sumelectthermal: -1275.297036 hartree
zpe.sumelectthermalent: -1275.296092 hartree
zpe.sumelectthermalfe: -1275.367705 hartree
dipole: 3.8867 -2.0056 -0.2212
dipole: 4.3793
quadrupole: -107.2767 -115.3777 -112.4273
quadrupole: -2.1002 1.0911 -4.1696
quadrupole: 4.4172 -3.6838 -0.7334 -2.1002 1.0911 -4.1696
hfenergy: -1275.4802388 hartree
pointgroup: C01 [X(C11H7F8N1)]
dipole: -1.6227695 0.4441165 0.3713955 debye
polarizability: 153.3530352|18.5301448|94.9752566|7.8161727|-2.1947846|120.4462108 unknown
InChI: InChI=1S/C11H7F8N/c12-8(10(14,15)16)9(13,11(17,18)19)20(8)6-7-4-2-1-3-5-7/h1-5H,6H2
charge 0 multiplicity 1
27 atoms
F  2.11968 0.554006 2.037812
F  0.906858 -1.711757 1.273315
F  2.284935 1.560368 -1.46449
F  2.414834 2.853637 0.393407
F  3.925004 1.18568 0.054586
F  2.205575 -2.083598 -1.318963
F  -0.026779 -2.462841 -1.136043
F  0.716858 -0.606868 -2.192075
N  0.254043 0.518672 0.416514
C  1.658673 0.578121 0.672114
C  0.952011 -0.716352 0.235345
C  -0.928492 0.88975 1.235571
C  2.575573 1.53717 -0.092878
C  0.959722 -1.461732 -1.108111
C  -2.218574 0.429095 0.574217
C  -2.431454 0.615001 -0.814821
C  -3.237087 -0.158023 1.362578
C  -3.652288 0.221823 -1.403959
C  -4.462311 -0.544669 0.773254
C  -4.672272 -0.355539 -0.611478
H  -0.892466 1.991731 1.320575
H  -0.833296 0.465561 2.252734
H  -1.640351 1.05734 -1.431043
H  -3.073238 -0.319549 2.435112
H  -3.807404 0.363118 -2.479036
H  -5.2445 -0.999122 1.390847
H  -5.618852 -0.660823 -1.070588
