program: Gaussian 09
title: 000283345
version: EM64L-G09RevD.01
frameworkgroup: C1[X(C12H18O3S)]
method: RPBEPBE
basis: SDD
operation: Freq
keyword: #p
keyword: freq=noraman
keyword: PBEPBE/SDD
title: #p freq=noraman PBEPBE/SDD
converged: YES YES NO NO
title: Mulliken charges:
elementType: S O O O C C C C C C C C C C C C H H H H H H H H H H H H H H H H H H
charge: 0.982447 -0.429425 -0.512875 -0.512896 0.253615 -0.258249 -0.708325 -0.697027 -0.697175 -0.036784 -0.239998 -0.240335 0.452148 -0.359895 -0.358986 -0.797561 0.223951 0.223989 0.213669 0.219376 0.213714 0.205800 0.205569 0.238951 0.205823 0.205576 0.239002 0.283569 0.283549 0.245676 0.245649 0.231204 0.231130 0.245121
chargesum: 0.00000
title: Mulliken charges with hydrogens summed into heavy atoms:
elementType: S O O O C C C C C C C C C C C C
charge: 0.982447 -0.429425 -0.512875 -0.512896 0.253615 0.189691 -0.061567 -0.046707 -0.046773 -0.036784 0.043571 0.043214 0.452148 -0.114218 -0.113337 -0.090106
polarizability: 2.22316182e+02 2.13642657e+01 1.37290575e+02 5.24169011e-02 -7.64888257e-02 1.53213273e+02
1716.lowfreq: -25.2648 -14.9119 -0.0014 -0.0011 -0.0011 6.3497 8.1694 23.2446 33.6865
frequency: -25.1845 23.0322 33.6660 34.4346 47.3083 95.5686 101.3159 126.9413 157.2828 162.8893 164.9834 226.6461 228.9469 234.1184 245.2505 291.8175 313.4762 319.2033 320.0324 372.2614 385.5879 394.3973 404.8403 407.4461 437.2098 474.6537 505.6908 584.1786 600.1826 621.6653 704.5962 743.6269 778.9058 825.4795 833.6451 848.7999 905.7526 916.3758 919.6232 933.6224 938.7415 946.7122 955.0393 963.4910 983.3010 991.6904 994.6433 1025.1618 1049.6666 1051.7120 1055.8558 1119.3641 1175.6518 1184.8974 1218.8312 1221.3646 1255.4945 1284.6459 1297.8503 1347.3399 1373.0763 1376.7860 1382.5950 1393.3574 1399.2561 1403.3200 1452.0481 1461.2770 1466.3900 1468.1252 1470.8854 1473.8545 1474.8598 1478.4887 1482.7848 1497.4026 1595.6290 1596.0812 2968.2009 2970.8354 2974.9676 2980.1477 2981.2066 3041.4539 3063.8043 3064.1375 3068.3040 3069.4603 3074.4516 3087.9531 3092.3663 3093.4788 3138.1122 3139.6141 3164.5924 3167.4241
redmass: 4.4272 3.0320 4.4464 4.3622 1.0131 2.2458 4.1640 7.1152 4.1468 1.1675 4.5395 6.2802 1.0570 1.1001 6.8744 3.9215 3.4983 3.6417 2.4258 5.3382 3.9562 2.6431 2.0940 2.8628 3.9577 5.2189 3.1342 6.9337 7.2423 6.9593 3.3333 3.5789 4.9219 1.7482 4.2469 1.2435 2.5877 2.8637 1.9580 1.9817 1.3388 1.2330 7.0913 1.2993 1.3978 1.4254 5.4121 1.4828 1.5965 1.4087 2.4913 1.2843 1.2964 1.1404 3.0383 2.6455 3.0062 1.9952 1.2628 1.2795 1.1939 1.2121 6.1042 3.0110 1.2183 1.2069 1.0486 1.0627 1.0553 1.0459 1.1028 2.0201 1.1466 1.0578 1.0678 1.0616 6.0260 6.9623 1.0417 1.0459 1.0356 1.0377 1.0390 1.1093 1.1001 1.0947 1.0996 1.0997 1.0984 1.0998 1.0990 1.1001 1.0893 1.0895 1.0956 1.0970
irintensity: 0.0064 1.3112 1.1705 0.0009 0.6509 1.0431 2.0160 2.1362 2.0397 0.1020 3.3620 9.6135 0.0827 0.4000 3.4509 8.0611 4.3747 1.5690 0.6324 3.8291 0.4587 13.5429 0.0740 0.0033 11.7699 78.8071 56.3593 31.8140 126.0393 0.1734 1.1217 1.7748 3.2035 109.6830 25.3424 0.1487 29.6898 75.1336 3.3016 12.5912 0.9719 0.5460 70.5701 1.6480 0.6879 3.8801 1.6767 11.3161 23.8944 1.1887 25.7047 7.2301 0.1058 10.6766 6.6395 10.2761 46.2775 6.7183 2.4440 0.6251 17.3977 26.0813 0.3587 11.0635 16.7551 17.1878 0.0345 11.9544 4.8678 1.1370 17.4130 19.2303 15.0086 11.1379 14.1226 23.5312 14.4945 0.0936 1.1189 70.9883 39.7047 29.9809 19.5012 9.5038 1.4807 17.2344 3.2272 59.7667 85.2850 3.9065 63.5366 14.4755 13.4072 6.2903 0.3319 9.1233
temp: 298.150 k
press: 1.00000 atm
elementType: 16 8 8 8 6 6 6 6 6 6 6 6 6 6 6 6 1 1 1 1 1 1 1 1 1 1 1 1 1 1 1 1 1 1
symmnumber: 1
zpe: 718798.0 jmol-1
zpe.correction: 0.273776 hartree
zpe.thermalcorrener: 0.291933 hartree
zpe.thermalcorrenthalpy: 0.292877 hartree
zpe.thermalcorrgfe: 0.226083 hartree
zpe.sumelectzpe: -1090.398883 hartree
zpe.sumelectthermal: -1090.380726 hartree
zpe.sumelectthermalent: -1090.379782 hartree
zpe.sumelectthermalfe: -1090.446576 hartree
dipole: -2.7054 -4.3920 -0.0069
dipole: 5.1584
quadrupole: -77.8016 -116.8811 -103.4706
quadrupole: 4.4632 0.0097 -0.0267
quadrupole: 21.5828 -17.4967 -4.0862 4.4632 0.0097 -0.0267
hfenergy: -1090.6726589 hartree
pointgroup: C01 [X(C12H18O3S1)]
dipole: -1.0543753 1.7340587 0.0114425 debye
polarizability: 222.0659118|-21.8548685|137.5424048|-0.1170027|-0.1807366|153.2117134 unknown
InChI: InChI=1S/C12H18O3S/c1-10-5-7-11(8-6-10)16(13,14)15-9-12(2,3)4/h5-8H,9H2,1-4H3
charge 0 multiplicity 1
34 atoms
S  0.206859 -1.589163 -0.010837
O  1.359549 -0.124494 0.001857
O  0.375153 -2.391786 1.388621
O  0.379079 -2.369973 -1.422102
C  3.627843 0.788309 0.007344
C  2.790428 -0.518341 0.000816
C  5.120087 0.358377 0.005567
C  3.316531 1.612162 1.282857
C  3.316901 1.624572 -1.260148
C  -1.385696 -0.60855 -0.005706
C  -1.952449 -0.261281 -1.241824
C  -1.957039 -0.280688 1.233629
C  -3.789581 0.820739 0.001003
C  -3.166063 0.45984 -1.223407
C  -3.170553 0.440693 1.221935
C  -5.108995 1.569839 0.004569
H  3.007765 -1.119998 0.905564
H  3.008584 -1.11156 -0.909326
H  5.368322 -0.245493 0.898865
H  5.769664 1.25305 0.010729
H  5.369101 -0.235812 -0.893973
H  3.543489 1.031694 2.197184
H  3.927032 2.533969 1.303014
H  2.250616 1.896517 1.314584
H  3.546477 1.054052 -2.18007
H  3.925386 2.547894 -1.270076
H  2.250433 1.907073 -1.290556
H  -1.470417 -0.556321 -2.179062
H  -1.478547 -0.59033 2.167964
H  -3.632965 0.746589 -2.172412
H  -3.640979 0.712624 2.173572
H  -5.212967 2.205195 0.900991
H  -5.2140 2.212006 -0.886826
H  -5.960847 0.862496 0.00246
