program: Gaussian 09
title: 000283314
version: EM64L-G09RevD.01
frameworkgroup: C1[X(C7H7Cl2N)]
method: RPBEPBE
basis: SDD
operation: Freq
keyword: #p
keyword: freq=noraman
keyword: PBEPBE/SDD
title: #p freq=noraman PBEPBE/SDD
converged: YES YES NO NO
title: Mulliken charges:
elementType: Cl Cl N C C C C C C C H H H H H H H
charge: -0.063594 -0.068679 -0.692845 0.620565 -0.599305 0.654061 -0.325498 -0.342601 -0.230141 -0.802178 0.230169 0.274507 0.246458 0.220273 0.246451 0.320246 0.312110
chargesum: 0.00000
title: Mulliken charges with hydrogens summed into heavy atoms:
elementType: Cl Cl N C C C C C C C
charge: -0.063594 -0.068679 -0.060489 0.620565 -0.369136 0.654061 -0.325498 -0.342601 0.044366 -0.088996
polarizability: 1.50074106e+02 3.99996625e+00 1.10259695e+02 3.56543267e-03 -3.61270555e-03 4.40747105e+01
1716.lowfreq: -5.3082 0.0020 0.0023 0.0037 0.1677 7.3618 91.5946 118.4507 142.5488
frequency: 91.5937 118.4250 142.5476 186.5245 243.5604 244.3928 288.5080 329.8285 351.2821 374.9048 389.0530 430.1790 457.5089 511.5668 588.2343 607.1128 665.4416 707.0140 727.0309 851.5911 862.8912 960.9751 992.7401 1037.3973 1046.9551 1069.8460 1185.0213 1254.6856 1298.5459 1378.5330 1403.6554 1414.8591 1462.1061 1466.4823 1489.4012 1577.1412 1611.7218 1639.2038 2986.7113 3066.7445 3094.9848 3128.1961 3181.6434 3557.8080 3704.6957
redmass: 5.0420 1.0848 4.8304 17.8070 4.6726 3.6720 3.5564 3.8596 8.8620 8.0521 1.2875 2.0327 1.3239 3.0560 5.9604 5.4441 7.5867 2.9545 6.0733 1.5443 1.4176 2.7174 1.7728 2.5165 1.5207 1.9493 1.7514 1.2611 4.6503 6.4762 1.2642 3.5520 1.0441 1.8963 1.7525 8.2895 2.2792 1.7829 1.0369 1.0973 1.0998 1.0911 1.0932 1.0455 1.1036
irintensity: 0.0149 1.3615 2.4364 0.8991 0.4276 1.3520 5.5578 13.4900 4.1427 2.0627 134.1899 99.0786 76.6420 0.5596 1.2998 0.0620 59.5829 2.0736 7.3539 1.7216 47.0952 28.3265 1.6588 17.2307 12.9533 42.2052 4.9279 22.5772 4.2022 12.3398 18.2429 27.1149 14.2339 39.0667 153.5312 2.6838 1.0560 261.2779 22.0515 13.9372 17.2790 15.9949 0.2818 82.7424 34.6904
temp: 298.150 k
press: 1.00000 atm
elementType: 17 17 7 6 6 6 6 6 6 6 1 1 1 1 1 1 1
symmnumber: 1
zpe: 324063.8 jmol-1
zpe.correction: 0.123429 hartree
zpe.thermalcorrener: 0.133580 hartree
zpe.thermalcorrenthalpy: 0.134524 hartree
zpe.thermalcorrgfe: 0.087610 hartree
zpe.sumelectzpe: -1245.096393 hartree
zpe.sumelectthermal: -1245.086242 hartree
zpe.sumelectthermalent: -1245.085298 hartree
zpe.sumelectthermalfe: -1245.132213 hartree
dipole: 1.3784 3.4680 0.0009
dipole: 3.7319
quadrupole: -69.2303 -63.3003 -76.4062
quadrupole: 2.8033 0.0032 -0.0090
quadrupole: 0.4153 6.3453 -6.7606 2.8033 0.0032 -0.0090
hfenergy: -1245.2198226 hartree
pointgroup: C01 [X(C7H7Cl2N1)]
dipole: 0.5428569 1.3641845 0.0009078 debye
dipolederiv: -0.6391224 -0.2783362 0.0000087 -0.327283 -0.327421 -0.0000444 0.0001359 0.0000614 -0.0688044 -0.6686417 0.2663798 0.0001245 0.2902035 -0.3032711 -0.000112 -0.0001993 0.0000693 -0.066341 -1.1767262 -0.6145784 0.0006487 -0.6373977 -0.5070249 -0.0016115 -0.000542 -0.0020568 -0.7174518 0.1479068 -0.0938848 -0.0001253 -0.2393111 0.190068 0.0001515 -0.0003623 0.0002071 0.0543852 -0.3086441 -0.284256 -0.0001357 0.1365315 0.0114814 0.0005095 -0.0003496 -0.0000123 -0.2517137 0.9457749 0.850296 0.0002379 0.8050971 0.3454812 0.0007085 0.0006813 0.0010688 0.1760413 0.6031244 0.5058774 -0.0000351 0.5978789 0.1828069 -0.0000757 -0.000158 -0.0002735 -0.1695197 0.6576163 -0.3971231 -0.0000874 -0.8585442 0.2011275 -0.0000019 0.000935 -0.0000932 -0.1507424 -0.0672863 -0.0933146 -0.0001397 0.0709479 -0.1391835 -0.0000797 -0.0001816 0.000255 -0.0127795 -0.151873 0.0893268 0.0000961 0.0481084 0.0997461 -0.0000329 0.000284 0.0000335 0.050279 0.0371259 -0.0083097 0.0000434 -0.0097905 -0.1188974 -0.0003345 0.0000696 -0.0003692 0.1681405 0.110673 0.0074358 0.0000139 0.0077399 0.0068738 -0.0000526 -0.0000154 -0.0000219 0.1668579 0.0005796 0.0266339 0.0797615 -0.0004624 0.0711876 0.0668355 0.1093021 0.018252 -0.0282625 0.0773257 -0.0923721 0.0000326 0.0206333 -0.1486856 0.0000413 0.000008 0.0000499 0.1093876 0.0004367 0.0266217 -0.0797617 -0.0006465 0.0711949 -0.0669049 -0.1092766 -0.0183097 -0.0278883 0.2454515 0.0346705 -0.0002022 0.0172113 0.1927769 0.0004977 -0.0006961 0.0001042 0.3812387 0.1862788 0.0549329 -0.0004802 0.0790837 0.171739 0.0005062 0.0003652 0.0010354 0.3871732 unknown
polarizability: 150.0772761|3.9841529|110.2565128|-0.0092758|0.0263356|44.0747217 unknown
InChI: InChI=1S/C7H7Cl2N/c1-4-2-7(10)6(9)3-5(4)8/h2-3H,10H2,1H3
charge 0 multiplicity 1
17 atoms
Cl -2.736454 -1.643435 -0.000374
Cl 2.825139 -1.552307 -0.000875
N  2.451756 1.479406 0.000494
C  -1.238171 0.74219 0.000357
C  -0.006763 1.436445 0.000607
C  1.256233 0.773681 -0.000622
C  -1.183538 -0.673671 -0.000579
C  1.229996 -0.648382 -0.001165
C  0.033668 -1.380003 -0.001001
C  -2.552522 1.494579 0.001401
H  -0.021435 2.532933 0.00211
H  0.049807 -2.472306 -0.001181
H  -3.159689 1.235438 0.887998
H  -2.386374 2.584643 0.001132
H  -3.161172 1.235199 -0.884101
H  3.337448 0.979528 0.00301
H  2.455671 2.494264 -0.002111
