program: Gaussian 09
title: 000283342
version: EM64L-G09RevD.01
frameworkgroup: C1[X(C24H16N2O4)]
method: RPBEPBE
basis: SDD
operation: Freq
keyword: #p
keyword: freq=noraman
keyword: PBEPBE/SDD
title: #p freq=noraman PBEPBE/SDD
converged: YES YES NO YES
title: Mulliken charges:
elementType: O O O O N N C C C C C C C C C C C C C C C C C C C C C C C C H H H H H H H H H H H H H H H H
charge: -0.207072 -0.207070 -0.207072 -0.207069 -0.204821 -0.204822 -0.571347 -0.571346 0.496625 0.496642 0.182267 0.182267 0.182268 0.182264 0.105991 0.105990 0.105989 0.105989 -0.388532 -0.388526 -0.388523 -0.388540 -0.352759 -0.352759 -0.352759 -0.352759 -0.210961 -0.210960 -0.210961 -0.210961 0.245808 0.245804 0.245805 0.245802 0.256877 0.256881 0.256881 0.256872 0.269460 0.269460 0.269460 0.269460 0.238689 0.238689 0.238689 0.238690
chargesum: 0.00000
title: Mulliken charges with hydrogens summed into heavy atoms:
elementType: O O O O N N C C C C C C C C C C C C C C C C C C C C C C C C
charge: -0.207072 -0.207070 -0.207072 -0.207069 -0.204821 -0.204822 -0.079735 -0.079739 0.496625 0.496642 0.182267 0.182267 0.182268 0.182264 0.105991 0.105990 0.105989 0.105989 -0.131655 -0.131646 -0.131642 -0.131667 -0.083299 -0.083299 -0.083299 -0.083299 0.027728 0.027728 0.027728 0.027728
polarizability: 2.49854193e+02 -1.10815964e-02 2.88911731e+02 6.36075882e-03 -8.63843127e-04 2.87746505e+02
1716.lowfreq: -5.3888 -3.6060 -0.0007 -0.0004 0.0005 2.9474 3.5472 11.8907 17.5530
frequency: 2.2881 11.8907 17.5325 27.2039 30.9463 38.7451 74.2720 118.2098 127.0401 138.1745 138.3684 152.5182 174.1488 180.1640 204.2731 238.7038 243.4201 264.2074 273.5183 318.2119 318.5163 333.8664 364.9369 374.3571 404.2392 409.1697 411.7814 451.7281 455.9733 456.0038 493.9891 522.9672 523.0237 536.1642 578.8174 598.9928 630.6350 635.6382 658.8512 658.8555 677.6008 678.0400 689.5492 695.7960 709.3103 721.1177 723.1547 784.6213 784.6976 787.9494 795.3959 808.9684 819.0526 823.9273 827.3210 862.4504 874.0591 906.3964 906.5896 926.0553 938.1599 942.8336 946.7757 974.2481 974.3301 975.9406 987.1738 1005.9398 1005.9534 1014.5492 1014.7726 1017.9403 1059.4240 1070.8187 1072.9660 1080.9491 1131.2128 1166.3261 1166.4288 1170.8262 1170.9879 1195.3124 1197.6907 1197.7672 1213.8114 1216.2152 1282.5697 1282.6832 1295.8707 1302.3012 1311.0329 1318.6636 1342.1456 1369.4048 1372.0050 1387.8188 1416.1676 1416.2758 1419.7707 1449.3773 1450.0947 1453.3322 1453.3513 1455.2624 1456.1366 1507.5411 1587.6019 1614.8548 1614.8743 1616.9911 1617.5343 1622.4035 1625.4299 1626.5909 1673.7526 1674.3350 3024.9215 3025.2199 3086.8306 3086.8927 3127.2742 3128.5759 3139.2522 3139.2582 3146.1193 3151.5370 3152.9449 3152.9560 3164.6524 3164.6666 3174.4622 3174.5056
redmass: 6.6643 6.6293 7.6715 6.6547 6.8044 3.8508 8.4072 7.8796 8.3027 5.0473 5.0860 7.6556 7.9501 7.6179 3.8932 6.8307 7.4333 7.2273 8.4599 10.4359 1.8691 10.9580 6.6523 1.9916 2.8532 3.1099 3.1755 4.3666 4.8821 4.8787 5.3387 7.1983 7.2077 7.2512 8.6102 9.4950 3.7011 6.4332 4.8250 4.8219 6.2525 6.4381 5.5846 5.2646 3.2532 2.8302 4.0770 5.3875 5.3920 1.7956 1.6917 3.3418 3.4636 3.8741 4.2515 1.2442 2.1431 1.3900 1.3892 2.8687 2.8405 6.0952 6.3240 1.4130 1.4133 1.4175 1.3784 1.3461 1.3461 2.1157 2.0396 2.9219 2.5975 2.5057 2.7410 2.5426 1.3503 1.2699 1.2566 2.0144 2.0135 1.6207 1.5647 2.5408 5.0064 2.1613 1.4742 1.4848 1.4486 1.7044 3.5986 3.8285 1.2360 1.6508 1.6275 5.2514 6.1447 6.1021 2.3120 1.4036 1.5155 2.4638 2.4638 1.8595 1.6492 2.5071 6.5936 7.6786 7.6731 8.7294 8.4242 6.2693 10.2676 10.7652 11.9413 11.9508 1.0588 1.0588 1.1050 1.1050 1.0881 1.0885 1.0864 1.0864 1.0966 1.0979 1.0906 1.0906 1.0956 1.0956 1.1004 1.1004
irintensity: 0.0000 0.0977 0.1169 0.0000 2.1793 0.0041 0.6233 14.7843 0.3458 0.0000 0.0001 2.4454 2.9514 0.6073 0.0000 0.4595 0.0000 0.0293 5.3015 12.7332 4.6522 19.5307 0.9265 0.0000 0.0000 0.7855 1.3166 0.6017 0.0019 0.0000 18.8516 0.0004 16.3544 3.2534 0.0039 9.1305 61.2806 0.0000 0.0000 0.0248 1.4863 0.0000 0.9361 0.0556 114.5177 55.8185 20.4349 0.0000 0.0608 90.0710 4.3190 0.1523 11.2368 3.4391 0.0000 4.8563 17.0130 0.0000 0.0033 71.5890 0.0000 2.5773 16.9569 4.5786 0.6120 3.0074 0.0000 0.0000 0.0055 1.6443 1.7153 6.4528 123.3616 0.0000 4.2359 0.0000 0.7003 9.8266 3.5323 0.0000 7.1902 9.0954 0.1131 2.7128 17.6335 3.5374 0.0000 0.1170 0.0000 30.9085 288.4533 321.0334 0.0000 21.0703 138.2159 5.7979 7.8112 14.5111 5.6138 3.5753 41.6966 0.0030 22.2956 0.0584 32.9530 16.1428 0.0000 1.6244 2.2859 0.0001 268.6013 2.0941 0.0000 516.4001 4.4067 91.7352 7.2602 38.2208 0.0079 1.0795 0.0000 10.6471 1.2109 2.3500 7.7658 0.7161 2.0919 8.8704 0.2755 11.0260 9.0750 32.7891
temp: 298.150 k
press: 1.00000 atm
elementType: 8 8 8 8 7 7 6 6 6 6 6 6 6 6 6 6 6 6 6 6 6 6 6 6 6 6 6 6 6 6 1 1 1 1 1 1 1 1 1 1 1 1 1 1 1 1
symmnumber: 1
zpe: 899352.5 jmol-1
zpe.correction: 0.342545 hartree
zpe.thermalcorrener: 0.366467 hartree
zpe.thermalcorrenthalpy: 0.367411 hartree
zpe.thermalcorrgfe: 0.282692 hartree
zpe.sumelectzpe: -1332.584748 hartree
zpe.sumelectthermal: -1332.560826 hartree
zpe.sumelectthermalent: -1332.559882 hartree
zpe.sumelectthermalfe: -1332.644601 hartree
dipole: -0.0008 5.1510 -0.0006
dipole: 5.1510
quadrupole: -150.1259 -143.7686 -185.3075
quadrupole: -0.0011 0.0014 -0.0050
quadrupole: 9.6081 15.9654 -25.5735 -0.0011 0.0014 -0.0050
hfenergy: -1332.9272936 hartree
pointgroup: C01 [X(C24H16N2O4)]
dipole: -0.0029783 -2.0265588 0.0002354 debye
polarizability: 249.8542893|0.0623473|288.9116348|-0.0063619|-0.0008555|287.7465048 unknown
InChI: InChI=1S/C24H16N2O4/c27-21-17-5-1-2-6-18(17)22(28)25(21)13-15-9-11-16(12-10-15)14-26-23(29)19-7-3-4-8-20(19)24(26)30/h1-12H,13-14H2
charge 0 multiplicity 1
46 atoms
O  3.653159 0.74097 -2.354781
O  3.6531 0.741254 2.354614
O  -3.651236 0.751198 2.354593
O  -3.651126 0.750382 -2.354793
N  3.522073 1.058168 -0.000105
N  -3.51916 1.06743 -0.000152
C  2.953083 2.422385 -0.000188
C  -2.946594 2.430144 -0.000369
C  1.426641 2.428453 -0.000237
C  -1.420143 2.432221 -0.000325
C  4.322449 -1.010444 -0.708389
C  4.322431 -1.010359 0.708451
C  -4.325395 -0.998738 0.708608
C  -4.325359 -0.998985 -0.708232
C  3.808824 0.315931 -1.182744
C  3.808792 0.316072 1.182633
C  -3.808048 0.326299 1.182658
C  -3.807981 0.325884 -1.182719
C  0.708812 2.428128 1.221986
C  -0.702387 2.430002 1.221944
C  0.708888 2.427922 -1.222505
C  -0.702311 2.429794 -1.222549
C  4.756233 -2.125392 -1.440057
C  4.756196 -2.125218 1.440264
C  -4.762351 -2.112279 1.440531
C  -4.762281 -2.112781 -1.439788
C  5.195952 -3.26013 -0.708724
C  5.195934 -3.260044 0.709079
C  -5.205283 -3.245935 0.70946
C  -5.205248 -3.246183 -0.708343
H  3.344848 2.927991 -0.899966
H  3.344787 2.928067 0.899574
H  -3.33704 2.936961 0.899302
H  -3.336987 2.936657 -0.900234
H  1.26004 2.417952 2.169633
H  -1.253674 2.421299 2.169572
H  1.260174 2.417586 -2.170117
H  -1.253538 2.420926 -2.17021
H  4.7519 -2.113927 -2.534423
H  4.751834 -2.113622 2.534629
H  -4.758009 -2.100564 2.534894
H  -4.757884 -2.10145 -2.534155
H  5.540519 -4.150288 -1.245826
H  5.540487 -4.150138 1.246297
H  -5.552391 -4.134981 1.246767
H  -5.55233 -4.135416 -1.245356
